Debian Package rebuild

Rebuild of the Debian archive with clang

"Cannot initialize a element" build failure(s)
clang 2.9
Return to the list

Versions: 2.9 - 3.0 - 3.1 - 3.2 - 3.3 - 3.4 - 3.4.2 - 3.5.0 - 3.6.0 - 3.8.1 - 3.9.1 - 4.0.1 - 5.0
PackageVersionSupposed error messageFull log Bug report
beast 0.7.4-2../birnet/birnetutils.hh:222:53: error: cannot initialize a variable of type 'bool' with an rvalue of type 'void' Log
capi4hylafax 1:01.03.00.99.svn.300-16aStdLib.cpp:253:14: error: cannot initialize a variable of type 'tWiChar *' (aka 'wchar_t *') with an rvalue of type 'const wchar_t *' Log
google-glog 0.3.1-1src/logging.cc:1246:8: error: cannot initialize a variable of type 'void (*)() __attribute__((noreturn))' with an rvalue of type 'void (*)()' Log
sipwitch 1.0.3-1linked.h:1846:17: error: cannot initialize return object of type 'ucommon::NamedObject **' with an rvalue of type 'ucommon::NamedObject *' Log
trafficserver 3.0.1-2./P_MultiCache.h:122:8: error: cannot initialize a parameter of type 'void *' with an rvalue of type 'volatile int (*)[2]' Log
ucommon 5.0.5-1../inc/ucommon/linked.h:1846:17: error: cannot initialize return object of type 'ucommon::NamedObject **' with an rvalue of type 'ucommon::NamedObject *' Log
6 errors
Return to the list