Debian Package rebuild

Rebuild of the Debian archive with clang

"Configure failed" build failure(s)
clang 2.9
Return to the list

Versions: 2.9 - 3.0 - 3.1 - 3.2 - 3.3 - 3.4 - 3.4.2 - 3.5.0 - 3.6.0 - 3.8.1
PackageVersionSupposed error messageFull log Bug report
ccbuild 2.0.1-1conftest.cpp:11:10: fatal error: 'ac_nonexistent.h' file not found Log
cdo 1.5.2.dfsg.1-1configure: error: C compiler cannot create executables Log
gluezilla 2.6-2conftest.c:10:10: fatal error: 'ac_nonexistent.h' file not found Log
libbluray 1:0.0~git20110717.3477b65-3conftest.c:11:10: fatal error: 'ac_nonexistent.h' file not found Log
libomxalsa 0.1-2conftest.c:10:10: fatal error: 'ac_nonexistent.h' file not found Log
libomxcamera 0.1-2conftest.c:10:10: fatal error: 'ac_nonexistent.h' file not found Log
libomxfbdevsink 0.1-2conftest.c:10:10: fatal error: 'ac_nonexistent.h' file not found Log
libomxil-bellagio 0.9.3-1conftest.c:11:10: fatal error: 'ac_nonexistent.h' file not found Log
libomxmad 0.1-1conftest.c:10:10: fatal error: 'ac_nonexistent.h' file not found Log
libomxvideosrc 0.1-1conftest.c:10:10: fatal error: 'ac_nonexistent.h' file not found Log
libomxvorbis 0.1-3conftest.c:10:10: fatal error: 'ac_nonexistent.h' file not found Log
libomxxvideo 0.1-2conftest.c:10:10: fatal error: 'ac_nonexistent.h' file not found Log
slrn 1.0.0~pre18-1.1conftest.c:9:10: fatal error: 'ac_nonexistent.h' file not found Log
srtp 1.4.4+20100615~dfsg-1configure: error: C compiler cannot create executables Log
synaesthesia 2.4-2configure: error: C compiler cannot create executables Log
tuxeyes 0.0.3-8configure: error: installation or configuration problem: C++ compiler cannot create executables. Log
uqwk 2.21-15configure: error: installation or configuration problem: C compiler cannot create executables. Log
valatoys 0.10.3-1conftest.c:11:10: fatal error: 'ac_nonexistent.h' file not found Log
xdiskusage 1.48-10configure: error: installation or configuration problem: C++ compiler cannot create executables. Log
19 errors
Return to the list