Debian Package rebuild

Rebuild of the Debian archive with clang

"Conflicting declaration" build failure(s)
clang 2.9
Return to the list

Versions: 2.9 - 3.0 - 3.1 - 3.2 - 3.3 - 3.4 - 3.4.2 - 3.5.0 - 3.6.0 - 3.8.1
PackageVersionSupposed error messageFull log Bug report
aprsd 1:2.2.5-13-5.1cstring:101:3: error: declaration conflicts with target of using declaration already in scope Log
octave-nan 2.4.1-2cstdlib:138:3: error: declaration conflicts with target of using declaration already in scope Log
sdpa 7.3.5.dfsg-1cstdlib:138:3: error: declaration conflicts with target of using declaration already in scope Log
3 errors
Return to the list