Debian Package rebuild

Rebuild of the Debian archive with clang

"Expected declaration (#define missing?)" build failure(s)
clang 2.9
Return to the list

Versions: 2.9 - 3.0 - 3.1 - 3.2 - 3.3 - 3.4 - 3.4.2 - 3.5.0 - 3.6.0 - 3.8.1
PackageVersionSupposed error messageFull log Bug report
asterisk-chan-capi 1.1.5-1logger.h:87:64: error: expected function body after function declarator Log
auto-multiple-choice 0.550-3AMC-traitement-image.c:228:28: error: expected ';' at end of declaration Log 746196
bogl 0.1.18-5bogl-font.c:83:23: error: expected ';' at end of declaration Log 758063
bsnes 0.081-2nested_exception.h:62:49: error: expected expression Log
c++-annotations 9.0.1-1nested_exception.h:62:49: error: expected expression Log
clamfs 1.0.1-1scancache.cxx:40:56: error: expected template-name before '<' token Log
clearsilver 0.10.5-1.1neo_files.c:219:12: error: expected expression Log 755963
enigmail 2:1.1.2-2nested_exception.h:62:49: error: expected expression Log
eurephia 1.0.1-3eurephiadm.c:203:46: error: expected ';' at end of declaration Log
filters 2.48cockney.l:21:12: error: expected ';' at end of declaration Log 758450
frozen-bubble 2.2.0-2fb_c_stuff.xs:99:23: error: expected ';' at end of declaration Log
gerris 20110329-dfsg.2-1../../../../doc/examples/modules.c:4:35: error: expected ';' at end of declaration Log
gpe-calendar 0.92-4calendars-widgets.c:711:38: error: expected ';' at end of declaration Log
grap 1.43-2nested_exception.h:62:49: error: expected expression Log
ivtools 1.2.8a1-6src/Attribute/attrvalue.cc:555:26: error: expected ')' Log
kdegames 4:4.6.5-1../../libkdegames/kgamerenderer.h:211:143: error: expected ')' Log
kdevplatform 1.2.2-1../../../interfaces/foregroundlock.cpp:38:19: error: expected expression Log
knights 2.3.2-1kgamerenderer.h:211:143: error: expected ')' Log
kraptor 0.0.20040403-6src/game.c:415:32: error: expected ';' at end of declaration Log 750370
libeventdb 0.90-4event-db.c:538:33: error: expected ';' at end of declaration Log
libgpevtype 0.50-5vcal.c:43:35: error: expected ';' at end of declaration Log
libhandoff 0.1-5handoff.c:257:21: error: expected ';' at end of declaration Log
libspf2 1.2.9-4spf_compile.c:580:5: error: expected expression Log
libsx 2.05-3popups.c:70:44: error: expected ';' at end of declaration Log 758560
luvcview 1:0.2.6-5v4l2uvc.c:197:29: error: expected ';' at end of declaration Log 750506
mandos 1.3.0-1plugin-runner.c:419:66: error: expected ';' at end of declaration Log 750516
matchbox-panel 0.9.3-5mb-applet-battery.c:181:41: error: expected ';' at end of declaration Log 750784
mcdp 0.4-5cddev.c:61:37: error: expected ';' at end of declaration Log
mdds 0.5.3-2nested_exception.h:62:49: error: expected expression Log
mozvoikko 1.10.0-1nested_exception.h:62:49: error: expected expression Log
mutrace 0.2.0-1libiberty.h:612:12: error: expected parameter declarator Log
ncpfs 2.2.6-8ncplib.c:2424:51: error: expected ';' at end of declaration Log
netplug 1.2.9.2-1if_info.c:294:36: error: expected ';' at end of declaration Log 750789
openjdk-6 6b23~pre9-1cc-qP9Oul.s:13:21: error: expected '@' or '%' before type Log
p3scan 2:2.3.2-7p3scan.c:2410:83: error: expected ';' at end of declaration Log 750874
packagesearch 2.6keymaker.h:77:7: error: expected expression Log
partconf 1.37util.c:147:50: error: expected ';' at end of declaration Log
pdp 1:0.12.5-1.1pdp_xwindow.c:148:23: error: expected ';' at end of declaration Log 758569
qsapecng 2.0.0-2parser.h:78:41: error: expected ')' Log
rainbow 0.8.6-1nss-rainbow.c:287:38: error: expected ';' at end of declaration Log 758571
rawstudio 2.0-1rs-tag-gui.c:102:102: error: expected ';' at end of declaration Log
rsh-redone 85-1rlogin.c:388:29: error: expected ';' at end of declaration Log 750957
rubberband 1.3-1.1rubberband/RubberBandStretcher.h:256:32: error: expected ')' before 'sampleRate' Log
sdl-ball 1.01-1main.cpp:1423:77: error: expected member name or ';' after declaration specifiers Log
sentinella 0.9.0-2MainWindow.h:70:33: error: expected ';' at end of declaration list Log
sludge 2.1.1-1nested_exception.h:62:49: error: expected expression Log
spl 1.0~pre6-2spl_modules/mod_format_xml.c:187:19: error: expected ';' at end of declaration Log 741605
stealth 2.02.01-3nested_exception.h:62:49: error: expected expression Log 745355
texmaker 3.0.2-2./texmaker.h:110:67: error: expected member name or ';' after declaration specifiers Log
vdr-plugin-dvd 0.3.6~b03+cvs20090426.0013-7dvdnav.h:284:47: error: expected ')' Log
visualboyadvance 1.8.0.dfsg-0.1debugger.cpp:1725:36: error: expected ')' Log
xfe 1.32.4-2xfeutils.cpp:478:24: error: expected ')' Log
xmlcopyeditor 1.2.0.6-1./housestyle.h:76:20: error: expected member name or ';' after declaration specifiers Log
53 errors
Return to the list