Debian Package rebuild

Rebuild of the Debian archive with clang

"No matching member or constructor call" build failure(s)
clang 2.9
Return to the list

Versions: 2.9 - 3.0 - 3.1 - 3.2 - 3.3 - 3.4 - 3.4.2 - 3.5.0 - 3.6.0 - 3.8.1 - 3.9.1 - 4.0.1 - 5.0
PackageVersionSupposed error messageFull log Bug report
cdrdao 1:1.2.3-0.1ScsiIf-linux.cc:287:9: error: no matching constructor for initialization of 'stat' Log
gpsshogi 0.4.0-1dualThreatmateState.h:14:11: error: no matching constructor for initialization of 'volatile struct Flags' Log
idesk 0.7.5-4.1DesktopConfig.cpp:134:12: error: no matching constructor for initialization of 'stat' Log
liblip 2.0.0-1.1tnt_sparse_matrix_csr.h:97:3: error: no matching constructor for initialization of 'Array1D' Log
linbox 1.1.6~rc0-4.1../../linbox/vector/subvector.h:102:10: error: no matching constructor for initialization of 'std::out_of_range' Log
ncurses 5.9-1cursesf.h:684:7: error: no matching constructor for initialization of 'NCursesForm' Log
openmsx 0.8.1-3src/utils/SerializeBuffer.hh:45:5: error: no matching member function for call to 'insertN' Log
pymol 1.4.1-1modules/cealign/src/tnt/tnt_sparse_matrix_csr.h:97:3: error: no matching constructor for initialization of 'Array1D' Log
toshset 1.76-1../cdsString.cc:514:4: error: no matching member function for call to 'setf' Log
xpdf 3.03-2build/GlobalParams.cc:1927:20: error: no matching member function for call to 'lookup' Log
10 errors
Return to the list