Debian Package rebuild

Rebuild of the Debian archive with clang

"Cannot find member in the struct" build failure(s)
clang 2.9
Return to the list

Versions: 2.9 - 3.0 - 3.1 - 3.2 - 3.3 - 3.4 - 3.4.2 - 3.5.0 - 3.6.0 - 3.8.1
PackageVersionSupposed error messageFull log Bug report
asio 1.4.1-3./../include/asio/ssl/detail/openssl_context_service.hpp:73:22: error: no member named 'SSLv2_method' in the global namespace Log
avbin 7-1.1avbin.c:177:40: error: no member named 'title' in 'struct AVFormatContext' Log
dammit 0~preview1-3libdammit/damnfile.cpp:92:39: error: no member named 'leaf' in 'boost::filesystem3::directory_entry' Log
dump 0.4b44-1traverse.c:999:51: error: no member named 'fragsize' in 'struct struct_ext2_filsys' Log
freefem3d 1.0pre10-2.1../solver/ConformTransformation.hpp:590:15: error: no member named 'gaussPivot' in the global namespace Log
syfi 0.6.2.dfsg-1syfi/swig/SyFi_wrap.cc:3366:50: error: no member named 'tinfo' in 'GiNaC::basic'; did you mean 'info'? Log
tcptrace 6.6.7-3print.c:380:41: error: no member named 'th_off' in 'struct tcphdr' Log
vdpau-video 0.6.3-1vdpau_driver.c:186:45: error: no member named 'x11_dpy' in 'struct VADriverContext' Log
8 errors
Return to the list