Debian Package rebuild

Rebuild of the Debian archive with clang

"Some files are gone in the process" build failure(s)
clang 2.9
Return to the list

Versions: 2.9 - 3.0 - 3.1 - 3.2 - 3.3 - 3.4 - 3.4.2 - 3.5.0 - 3.6.0 - 3.8.1
PackageVersionSupposed error messageFull log Bug report
acm 5.0-27mv: cannot stat `dis_xdr.c': No such file or directory Log 740019
arrayprobe 2.0-3.1tar (child): /usr/src/.tar.bz2: Cannot open: No such file or directory Log
camstream 0.27+dfsg-4common/../linux/VideoDeviceLinux.h:9:28: fatal error: linux/videodev.h: No such file or directory Log
cpqarrayd 2.3-1.2tar (child): /usr/src/.tar.bz2: Cannot open: No such file or directory Log
gauche-c-wrapper 0.6.1-4clang: error: no such file or directory: '/usr/lib/libffi_pic.a' Log
gcc-avr 1:4.5.3-2bash: debian/runcheck.sh: No such file or directory Log
gcc-m68hc1x 1:3.3.6+3.1+dfsg-3cp: cannot create regular file `/usr/m68hc11/sys-include/_inst.7505_': No such file or directory Log
ghdl 0.29+gcc4.3.4+dfsg-1features.h:323:26: error: bits/predefs.h: No such file or directory Log
gnome-mplayer 1.0.4-1support.h:46:23: fatal error: gpod/itdb.h: No such file or directory Log
graphviz 2.26.3-7cp: cannot stat `debian/tmp/usr/share/man/man3/gv.3python': No such file or directory Log
gringo 3.0.3-6clang: error: no such file or directory: '/c' Log
imms 3.1.0~rc8-2install: cannot stat `build/libaudaciousimms.so': No such file or directory Log
ir.lv2 1.3.1~dfsg0-1clang: error: no such file or directory: 'nodelete' Log
jaminid 0.99a-1xargs: /usr/lib/jvm/java-6-openjdk/bin/javac: No such file or directory Log
jfractionlab 0.86-1xargs: /usr/lib/jvm/java-6-openjdk//bin/javac: No such file or directory Log
kdeutils 4:4.6.5-2cp: cannot stat `debian/tmp/usr/lib/kde4/kerfuffle_libbz2.so': No such file or directory Log
kst 2.0.3-1clang: error: no such file or directory: '/FI/build/kst-n01Gza/kst-2.0.3/obj-x86_64-linux-gnu/src/libkst/kstcore_pch.h' Log
libtunepimp 0.5.3-7.4protocol.cpp:17:24: fatal error: curl/types.h: No such file or directory Log
live-manual 1:3.0~a7-1wc: live-manual.ssm.sst: No such file or directory Log
nepenthes 0.2.2-6.1download-curl.hpp:31:41: fatal error: curl/types.h: No such file or directory Log
obrowser 1.1.1+dfsg-1clang: error: no such file or directory: 'vm.js' Log
ocfs2-tools 1.6.3-2cp: cannot stat `debian/tmp/debian/tmp/sbin/ocfs2_controld.cman': No such file or directory Log
ognl 2.7.3-3cp: cannot stat `debian/tmp/dist/docs/pdf/DeveloperGuide.pdf': No such file or directory Log
oopango 1.0-1cp: cannot stat `debian/tmp/usr/lib/lua': No such file or directory Log
openttd-opengfx 0.3.5-1Can't read sprites/png/houses/base-1421.1425.1424 -offices.png: No such file or directory Log
pgfincore 1.0-1cp: cannot stat `./debian/pgfincore-9.0/pgfincore.so': No such file or directory Log
policycoreutils 2.0.82-5chmod: cannot access `/build/policycoreutils-1ZPs3j/policycoreutils-2.0.82/debian/policycoreutils/etc/init.d/policycoreutils': No such file or directory Log
scilab-ann 0.4.2.4-1Error: libjvm.so: cannot open shared object file: No such file or directory Log
scilab-celestlab 2.1.1-1-3Error: libjvm.so: cannot open shared object file: No such file or directory Log
scilab-jims 0.2-1Error: libjvm.so: cannot open shared object file: No such file or directory Log
scilab-overload 1.3.3-1Error: libjvm.so: cannot open shared object file: No such file or directory Log
scilab-plotlib 0.42-1Error: libjvm.so: cannot open shared object file: No such file or directory Log
scilab-scimax 2.1.4-1Error: libjvm.so: cannot open shared object file: No such file or directory Log
scilab-scimysql 0.1.1-3Error: libjvm.so: cannot open shared object file: No such file or directory Log
scim-bridge 0.4.16-2rm: cannot remove `debian/tmp/usr/lib/gtk-2.0/*/immodules/im-scim-bridge.a': No such file or directory Log
sivp 0.5.3-2Error: libjvm.so: cannot open shared object file: No such file or directory Log
slgtk 0.7.6-1sed: can't read src/Makefile: No such file or directory Log
sssd 1.2.1-4.2cp: cannot stat `debian/tmp/usr/lib/ldb/modules/ldb/memberof.so': No such file or directory Log
stereograph 0.30a-6clang: error: no such file or directory: '/usr/lib/libpng.so' Log
terraintool 1.09a-2xargs: /usr/lib/jvm/java-6-openjdk/bin/javac: No such file or directory Log
thunar-vfs 1.2.0-3grep: foo: No such file or directory Log
tora 2.1.3-1clang: error: no such file or directory: '/c' Log
tunnelx 20110801-2xargs: /usr/lib/jvm/java-6-openjdk/bin/javac: No such file or directory Log
upse 0.6.0-1.1plugin.c:19:30: fatal error: audacious/output.h: No such file or directory Log
vdkbuilder2 2.4.0-4.1gdktypes.h:55:23: fatal error: gdkconfig.h: No such file or directory Log
weirdx 1.0.32-5xargs: /usr/lib/jvm/java-6-openjdk/bin/javac: No such file or directory Log
wine-unstable 1.1.35-1errno.h:4:23: error: asm/errno.h: No such file or directory Log
xcircuit 3.7.26.dfsg-1ld: cannot find defs: No such file or directory Log
48 errors
Return to the list