Debian Package rebuild

Rebuild of the Debian archive with clang

"Segmentation fault" build failure(s)
clang 2.9
Return to the list

Versions: 2.9 - 3.0 - 3.1 - 3.2 - 3.3 - 3.4 - 3.4.2 - 3.5.0 - 3.6.0 - 3.8.1 - 3.9.1 - 4.0.1 - 5.0
PackageVersionSupposed error messageFull log Bug report
axiom 20110301a-1Segmentation fault Log
botan1.8 1.8.13-4make[1]: *** [override_dh_auto_test] Segmentation fault Log
delta 2006.08.03-3Segmentation fault Log
elmerfem 6.1.0.svn.5272.dfsg-1bash: line 1: 7625 Segmentation fault /lib/cpp -I/build/elmerfem-uM4zmY/elmerfem-6.1.0.svn.5272.dfsg/debian/tmp/usr/include -DCONTIG=",CONTIGUOUS" -P -traditional-cpp -I. -I/usr/include -DFULL_INDUCTION -DUSE_ARPACK -I/usr/include/mpi -DHAVE_MUMPS NavierStokes.src > NavierStokes.f90 Log
ferret-vis 6.6.2-1make[2]: *** [list.h] Segmentation fault Log
freeipmi 0.8.12-3make[3]: *** [libfreeipmi.3] Segmentation fault Log
gambc 4.2.8-1.1clang: error: unable to execute command: Segmentation fault Log
gdk-pixbuf 2.24.0-1Segmentation fault Log
hiredis 0.10.1-2make[2]: *** [test] Segmentation fault Log
libtuxcap 1.4.0.dfsg2-2clang: error: unable to execute command: Segmentation fault Log
pyfribidi 0.10.0-3utf8: reorder line as LTR ... Segmentation fault Log
ruby1.9.1 1.9.2.290-2:1: [BUG] Segmentation fault Log
seabios 0.6.1.2-3make[1]: *** [src/acpi-dsdt.hex] Segmentation fault Log
tcc 0.9.25-10make[2]: *** [test.ref] Segmentation fault Log
wcd 5.1.5-1make[2]: *** [man/man1/wcd1.pod] Segmentation fault Log
15 errors
Return to the list