Debian Package rebuild

Rebuild of the Debian archive with clang

"Wrong resolution without typename" build failure(s)
clang 2.9
Return to the list

Versions: 2.9 - 3.0 - 3.1 - 3.2 - 3.3 - 3.4 - 3.4.2 - 3.5.0 - 3.6.0 - 3.8.1
PackageVersionSupposed error messageFull log Bug report
h5utils 1.12.1-1DiagArray2.h:97:19: error: dependent using declaration resolved to type without 'typename' Log
mathgl 1.11.2-2DiagArray2.h:97:19: error: dependent using declaration resolved to type without 'typename' Log
octave-ad 1.0.6-4DiagArray2.h:97:19: error: dependent using declaration resolved to type without 'typename' Log
octave-audio 1.1.4-3DiagArray2.h:97:19: error: dependent using declaration resolved to type without 'typename' Log
octave-combinatorics 1.0.9-3DiagArray2.h:97:19: error: dependent using declaration resolved to type without 'typename' Log
octave-communications 1.0.10-3DiagArray2.h:97:19: error: dependent using declaration resolved to type without 'typename' Log
octave-econometrics 1:1.0.8-3DiagArray2.h:97:19: error: dependent using declaration resolved to type without 'typename' Log
octave-fixed 0.7.10-3DiagArray2.h:97:19: error: dependent using declaration resolved to type without 'typename' Log
octave-ftp 1.0.2-4DiagArray2.h:97:19: error: dependent using declaration resolved to type without 'typename' Log
octave-general 1.2.2-2DiagArray2.h:97:19: error: dependent using declaration resolved to type without 'typename' Log
octave-gsl 1.0.8-3DiagArray2.h:97:19: error: dependent using declaration resolved to type without 'typename' Log
octave-image 1.0.14-2DiagArray2.h:97:19: error: dependent using declaration resolved to type without 'typename' Log
octave-linear-algebra 2.0.0-2DiagArray2.h:97:19: error: dependent using declaration resolved to type without 'typename' Log
octave-miscellaneous 1.0.11-1DiagArray2.h:97:19: error: dependent using declaration resolved to type without 'typename' Log 749154
octave-nlwing2 1.2.0-2DiagArray2.h:97:19: error: dependent using declaration resolved to type without 'typename' Log
octave-nurbs 1.3.3-1DiagArray2.h:97:19: error: dependent using declaration resolved to type without 'typename' Log
octave-ocs 0.1.1-1DiagArray2.h:97:19: error: dependent using declaration resolved to type without 'typename' Log
octave-octcdf 1.0.13-2DiagArray2.h:97:19: error: dependent using declaration resolved to type without 'typename' Log
octave-octgpr 1.2.0-2DiagArray2.h:97:19: error: dependent using declaration resolved to type without 'typename' Log
octave-odepkg 0.6.12-1DiagArray2.h:97:19: error: dependent using declaration resolved to type without 'typename' Log
octave-optim 1.0.16-1DiagArray2.h:97:19: error: dependent using declaration resolved to type without 'typename' Log
octave-optiminterp 0.3.3-1DiagArray2.h:97:19: error: dependent using declaration resolved to type without 'typename' Log
octave-parallel 2.0.5-1DiagArray2.h:97:19: error: dependent using declaration resolved to type without 'typename' Log
octave-pdb 1.0.7-3DiagArray2.h:97:19: error: dependent using declaration resolved to type without 'typename' Log
octave-secs1d 0.0.8-3DiagArray2.h:97:19: error: dependent using declaration resolved to type without 'typename' Log
octave-secs2d 0.0.8-3DiagArray2.h:97:19: error: dependent using declaration resolved to type without 'typename' Log
octave-signal 1.0.11-2DiagArray2.h:97:19: error: dependent using declaration resolved to type without 'typename' Log
octave-sockets 1.0.7-1DiagArray2.h:97:19: error: dependent using declaration resolved to type without 'typename' Log
octave-specfun 1.0.9-1DiagArray2.h:97:19: error: dependent using declaration resolved to type without 'typename' Log
octave-strings 1.0.7-3DiagArray2.h:97:19: error: dependent using declaration resolved to type without 'typename' Log
octave-struct 1.0.9-1DiagArray2.h:97:19: error: dependent using declaration resolved to type without 'typename' Log
octave-symband 1.0.10-2DiagArray2.h:97:19: error: dependent using declaration resolved to type without 'typename' Log
octave-symbolic 1.0.9-2DiagArray2.h:97:19: error: dependent using declaration resolved to type without 'typename' Log
octave3.2 3.2.4-11./DiagArray2.h:97:19: error: dependent using declaration resolved to type without 'typename' Log
pfstools 1.8.1-2DiagArray2.h:97:19: error: dependent using declaration resolved to type without 'typename' Log
rtorrent 0.8.7-7./../rpc/command.h:84:20: error: dependent using declaration resolved to type without 'typename' Log
semidef-oct 1:2003-10DiagArray2.h:97:19: error: dependent using declaration resolved to type without 'typename' Log
37 errors
Return to the list