Debian Package rebuild

Rebuild of the Debian archive with clang

"No matching member or constructor call" build failure(s)
clang 3.0
Return to the list

Versions: 2.9 - 3.0 - 3.1 - 3.2 - 3.3 - 3.4 - 3.4.2 - 3.5.0 - 3.6.0 - 3.8.1
PackageVersionSupposed error messageFull log Bug report
libdecodeqr 0.9.3-6.2lsh_index.h:89:81: error: no matching constructor for initialization of 'cvflann::LshIndexParams' Log
liblip 2.0.0-1.1tnt_sparse_matrix_csr.h:97:3: error: no matching constructor for initialization of 'Array1D' Log
toshset 1.76-2../cdsString.cc:514:4: error: no matching member function for call to 'setf' Log
3 errors
Return to the list