Debian Package rebuild

Rebuild of the Debian archive with clang

"xutils-dev build tool is failing" build failure(s)
clang 3.0
Return to the list
All this build failure are caused by the same bug in imake (xutils-dev). Looks like that clang preprocessor is eating some tab/space which matters for imake.
Versions: 2.9 - 3.0 - 3.1 - 3.2 - 3.3 - 3.4 - 3.4.2 - 3.5.0 - 3.6.0 - 3.8.1 - 3.9.1 - 4.0.1 - 5.0
PackageVersionSupposed error messageFull log Bug report
9menu 1.8-5Imake.rules:1674:27: error: empty character constant Log
9wm 1.2-9Imake.rules:1674:27: error: empty character constant Log
acfax 981011-14.1Imake.rules:1674:27: error: empty character constant Log
ascd 0.13.2-5Imake.rules:1674:27: error: empty character constant Log
ascdc 0.3-14Imake.rules:1674:27: error: empty character constant Log
asclock 2.0.12-19Imake.rules:1674:27: error: empty character constant Log
battleball 2.0-17Imake.rules:1674:27: error: empty character constant Log
canna 3.7p3-6.5Imake.rules:1674:27: error: empty character constant Log
chimera2 2.0a19-6Imake.rules:1674:27: error: empty character constant Log
ctwm 3.7-3.1Imake.rules:1674:27: error: empty character constant Log
dclock 2.2.2-6Imake.rules:1674:27: error: empty character constant Log
floatbg 1.0-28Imake.rules:1674:27: error: empty character constant Log
fvwm1 1.24r-55Imake.rules:1674:27: error: empty character constant Log
ibp 0.21-7Imake.rules:1674:27: error: empty character constant Log
kinput2 3.1-10.2Imake.rules:1674:27: error: empty character constant Log
knews 1.0b.1-26Imake.rules:1674:27: error: empty character constant Log
koules 1.4-18Imake.rules:1674:27: error: empty character constant Log
kterm 6.2.0-46Imake.rules:1674:27: error: empty character constant Log
larswm 7.5.3-6Imake.rules:1674:27: error: empty character constant Log
lwm 1.2.2-2Imake.rules:1674:27: error: empty character constant Log
mgdiff 1.0-29Imake.rules:1674:27: error: empty character constant Log
mgp 1.13a+upstream20090219-3Imake.rules:1674:27: error: empty character constant Log
netmaze 0.81+jpg0.82-14Imake.rules:1674:27: error: empty character constant Log
nitpic 0.1-13Imake.rules:1674:27: error: empty character constant Log
pacman 10-17Imake.rules:1674:27: error: empty character constant Log
pixmap 2.6pl4-18Imake.rules:1674:27: error: empty character constant Log
sciplot 1.36-15Imake.rules:1674:27: error: empty character constant Log
seyon 2.20c-31Imake.rules:1674:27: error: empty character constant Log
ssh-askpass 1:1.2.4.1-9Imake.rules:1674:27: error: empty character constant Log
ssvnc 1.0.29-2Imake.rules:1674:27: error: empty character constant Log
tex-guy 1.3.2-6.1Imake.rules:1674:27: error: empty character constant Log
tgif 1:4.2.5-1Imake.rules:1674:27: error: empty character constant Log
transfig 1:3.2.5.d-2Imake.rules:1674:27: error: empty character constant Log
vtwm 5.4.7-2.2Imake.rules:1674:27: error: empty character constant Log
w9wm 0.4.2-7Imake.rules:1674:27: error: empty character constant Log
wmcdplay 1.0beta1-10Imake.rules:1674:27: error: empty character constant Log
wmclock 1.0.14-1Imake.rules:1674:27: error: empty character constant Log
wmdate 0.7-4Imake.rules:1674:27: error: empty character constant Log
wmnet 1.05-17Imake.rules:1674:27: error: empty character constant Log
wnn6-sdk 1.0.0-14.2Imake.rules:1674:27: error: empty character constant Log
x2x 1.27.svn.20060501-4Imake.rules:1674:27: error: empty character constant Log
xarclock 1.0-12Imake.rules:1674:27: error: empty character constant Log
xautolock 1:2.2-3Imake.rules:1674:27: error: empty character constant Log
xaw3d 1.5+E-18.1Imake.rules:1674:27: error: empty character constant Log
xbattle 5.4.1-15Imake.rules:1674:27: error: empty character constant Log
xboing 2.4-31Imake.rules:1674:27: error: empty character constant Log
xcal 4.1-19Imake.rules:1674:27: error: empty character constant Log
xcb 2.4-4.1Imake.rules:1674:27: error: empty character constant Log
xcolors 1.5a-7Imake.rules:1674:27: error: empty character constant Log
xcolorsel 1.1a-17Imake.rules:1674:27: error: empty character constant Log
xdemineur 2.1.1-16Imake.rules:1674:27: error: empty character constant Log
xdu 3.0-17Imake.rules:1674:27: error: empty character constant Log
xeji 1.2-14Imake.rules:1674:27: error: empty character constant Log
xfaces 3.3-28Imake.rules:1674:27: error: empty character constant Log
xfishtank 2.2-25.2Imake.rules:1674:27: error: empty character constant Log
xflip 1.01-25Imake.rules:1674:27: error: empty character constant Log
xfonts-jmk 3.0-19Imake.rules:1674:27: error: empty character constant Log
xgammon 0.99.1128-3Imake.rules:1674:27: error: empty character constant Log
xipmsg 0.8088-2.1Imake.rules:1674:27: error: empty character constant Log
xjig 2.4-13Imake.rules:1674:27: error: empty character constant Log
xkeycaps 2.47-4Imake.rules:1674:27: error: empty character constant Log
xlbiff 4.1-7Imake.rules:1674:27: error: empty character constant Log
xli 1.17.0+20061110-3Imake.rules:1674:27: error: empty character constant Log
xmille 2.0-13Imake.rules:1674:27: error: empty character constant Log
xmix 2.1-6Imake.rules:1674:27: error: empty character constant Log
xmotd 1.17.3b-5Imake.rules:1674:27: error: empty character constant Log
xmountains 2.9-2Imake.rules:1674:27: error: empty character constant Log
xnecview 1.35-7.1Imake.rules:1674:27: error: empty character constant Log
xonix 1.4-28Imake.rules:1674:27: error: empty character constant Log
xpaint 2.9.1.4-3Imake.rules:1674:27: error: empty character constant Log
xpat2 1.07-17Imake.rules:1674:27: error: empty character constant Log
xphoon 20000613+0-1Imake.rules:1674:27: error: empty character constant Log
xscavenger 1.4.4-8Imake.rules:1674:27: error: empty character constant Log
xsok 1.02-17Imake.rules:1674:27: error: empty character constant Log
xsysinfo 1.7-9Imake.rules:1674:27: error: empty character constant Log
xtel 3.3.0-11Imake.rules:1674:27: error: empty character constant Log
xtrlock 2.0-14Imake.rules:1674:27: error: empty character constant Log
xtv 1.1-12Imake.rules:1674:27: error: empty character constant Log
xvier 1.0-7.5Imake.rules:1674:27: error: empty character constant Log
xvkbd 3.0-1Imake.rules:1674:27: error: empty character constant Log
xxgdb 1.12-17Imake.rules:1674:27: error: empty character constant Log
xxkb 1.11-2.1Imake.rules:1674:27: error: empty character constant Log
xzoom 0.3-23Imake.rules:1674:27: error: empty character constant Log
ygl 4.2e-4Imake.rules:1674:27: error: empty character constant Log
84 errors
Return to the list