Debian Package rebuild

Rebuild of the Debian archive with clang

"Variable length array for a non POD (plain old data) element" build failure(s)
clang 3.1
Return to the list
The following code is not (and won't) supported by clang.
#include <vector>

void foo() {
    int N=2;
    std::vector<int> best[2][N];
}

Versions: 2.9 - 3.0 - 3.1 - 3.2 - 3.3 - 3.4 - 3.4.2 - 3.5.0 - 3.6.0 - 3.8.1
PackageVersionSupposed error messageFull log Bug report
apertium 3.1.0-2hmm.cc:730:23: error: variable length array of non-POD element type 'vector' Log 748976
disulfinder 1.2.11-2Input/buildXfolds.cpp:16:41: error: variable length array of non-POD element type 'std::vector' Log
dynare 4.3.0-2DynamicModel.cc:213:19: error: variable length array of non-POD element type 'ostringstream' (aka 'basic_ostringstream') Log
extrema 4.4.5.dfsg-3AxisPopup.cpp:217:19: error: variable length array of non-POD element type 'wxString' Log 742158
fldigi 3.21.45-2throb/throb.cxx:413:16: error: variable length array of non-POD element type 'complex' Log
fte 0.50.2b6-1con_linux.cpp:434:12: error: variable length array of non-POD element type 'TCell' Log 749086
handlersocket 1.1.0-7-g1044a28-1HandlerSocket.xs:525:19: error: variable length array of non-POD element type 'execute_arg' Log 749088
kcometen4 1.0.7-1cometen3.cpp:200:18: error: variable length array of non-POD element type 'Vec3f' Log 749137
mandelbulber 1:1.11-1../src/Render3D.cpp:1036:15: error: variable length array of non-POD element type 'sParam' Log
mrtrix 0.2.10-2cmd/gen_ROI.cpp:89:23: error: variable length array of non-POD element type 'std::vector' Log
musescore 1.2+dfsg-1rendermidi.cpp:559:36: error: variable length array of non-POD element type 'QList' Log 752124
octave-miscellaneous 1.1.0-1partarray.cc:42:31: error: variable length array of non-POD element type 'Array' Log 749154
pfstmo 1.4-1display_adaptive_tmo.cpp:743:26: error: variable length array of non-POD element type 'UniformArrayLUT' Log 749156
qelectrotech 0.22+svn897-1sources/customelement.cpp:514:16: error: variable length array of non-POD element type 'QPointF' Log 749158
s2tc 0~git20110809-3s2tc_algorithm.cpp:751:12: error: variable length array of non-POD element type '::color_t' Log
saods9 7.0.1+dfsg-1grid25dbase.C:32:12: error: variable length array of non-POD element type 'Vector' Log
scim 1.4.13-5scim_helper_manager_server.cpp:98:24: error: variable length array of non-POD element type 'scim::HelperModule' Log 750115
sdcv 0.4.2-15libwrapper.cpp:212:26: error: variable length array of non-POD element type 'std::vector' Log
sfst 1.2.0-1.2compact.C:256:18: error: variable length array of non-POD element type 'Label' Log 750116
simutrans 111.2.2-1freight_list_sorter.cc:114:2: error: variable length array of non-POD element type 'ware_t' Log 750121
stardict 3.0.1-9.1t_lookupdata.cpp:20:30: error: variable length array of non-POD element type 'std::vector' Log
steghide 0.5.1-9BmpFile.cc:217:44: error: variable length array of non-POD element type 'std::vector' Log 750123
texmacs 1:1.0.7.15-1./Typeset/Bridge/bridge_with.cpp:129:3: error: variable length array of non-POD element type 'string' Log 756333
tophat 2.0.3-1segment_juncs.cpp:4834:47: error: variable length array of non-POD element type 'std::set' Log
voxbo 1.8.5~svn1246-1tes.cpp:1339:12: error: variable length array of non-POD element type 'Tes' Log
25 errors
Return to the list