Debian Package rebuild

Rebuild of the Debian archive with clang

"Redefinition failed" build failure(s)
clang 3.1
Return to the list

Versions: 2.9 - 3.0 - 3.1 - 3.2 - 3.3 - 3.4 - 3.4.2 - 3.5.0 - 3.6.0 - 3.8.1
PackageVersionSupposed error messageFull log Bug report
aghermann 0.6.0.1-1./sigproc.ii:64:20: error: redefinition of default argument Log
sslsniff 0.8-3SSLConnectionManager.cpp:98:17: error: redefinition of 'error' with a different type Log
tripwire 2.4.2.2-2archive.cpp:889:26: error: redefinition of 'e' with a different type Log
3 errors
Return to the list