Debian Package rebuild

Rebuild of the Debian archive with clang

"Argument unused caused failure" build failure(s)
clang 3.1
Return to the list
Unknown or unused arguments triggers errors with -Werror:
clang -Werror -ggdb3 foo.c

Versions: 2.9 - 3.0 - 3.1 - 3.2 - 3.3 - 3.4 - 3.4.2 - 3.5.0 - 3.6.0 - 3.8.1
PackageVersionSupposed error messageFull log Bug report
aptitude 0.6.8-1clang: error: argument unused during compilation: '--param ssp-buffer-size=4' Log
axis2c 1.6.0-5.1clang: error: argument unused during compilation: '--param ssp-buffer-size=4' Log 753543
bin-prot 2.0.7-1clang: error: argument unused during compilation: '-fno-defer-pop' Log
chromium-browser 20.0.1132.43~r143823-1clang: error: argument unused during compilation: '--param ssp-buffer-size=4' Log
cifs-utils 2:5.5-1clang: error: argument unused during compilation: '--param ssp-buffer-size=4' Log
clutter-gesture 0.0.2.1-7clang: error: argument unused during compilation: '--param ssp-buffer-size=4' Log
couchdb 1.1.1-2clang: error: argument unused during compilation: '-L/usr/local/lib' Log
cwidget 0.5.16-3.4clang: error: argument unused during compilation: '--param ssp-buffer-size=4' Log
deb-gview 0.2.9clang: error: argument unused during compilation: '--param ssp-buffer-size=4' Log
distro-info 0.10clang: error: argument unused during compilation: '--param ssp-buffer-size=4' Log
donkey 0.5-19clang: error: argument unused during compilation: '--param ssp-buffer-size=4' Log
doxymacs 1.8.0-6clang: error: argument unused during compilation: '-fexpensive-optimizations' Log
dumpet 2.1-4clang: error: argument unused during compilation: '--param ssp-buffer-size=4' Log
ekeyd 1.1.5-4clang: error: argument unused during compilation: '--param ssp-buffer-size=4' Log
elfutils 0.153-1clang: error: argument unused during compilation: '--param ssp-buffer-size=4' Log 758064
fastx-toolkit 0.0.13.2-1clang: error: argument unused during compilation: '--param ssp-buffer-size=4' Log
gpdftext 0.1.5-1clang: error: argument unused during compilation: '--param ssp-buffer-size=4' Log
guile-cairo 1.4.0-3clang: error: argument unused during compilation: '--param ssp-buffer-size=4' Log
guile-gnome-platform 2.16.2-1clang: error: argument unused during compilation: '--param ssp-buffer-size=4' Log
gxneur 0.15.0-2clang: error: argument unused during compilation: '--param ssp-buffer-size=4' Log
ibus-client-clutter 0.0+git20090728.a936bacf-4clang: error: argument unused during compilation: '--param ssp-buffer-size=4' Log
ido 0.3.4-1clang: error: argument unused during compilation: '--param ssp-buffer-size=4' Log
indicator-messages 0.6.0-1clang: error: argument unused during compilation: '--param ssp-buffer-size=4' Log
indicator-session 0.3.96-1clang: error: argument unused during compilation: '--param ssp-buffer-size=4' Log 751444
ion 3.0.1~dfsg1-1clang: error: argument unused during compilation: '--param ssp-buffer-size=4' Log 754319
jansson 2.3.1-2clang: error: argument unused during compilation: '--param ssp-buffer-size=4' Log
jellyfish 1.1.5-1clang: error: argument unused during compilation: '--param ssp-buffer-size=4' Log 749136
json-c 0.9-1.1clang: error: argument unused during compilation: '--param ssp-buffer-size=4' Log
keyutils 1.5.5-2clang: error: argument unused during compilation: '--param ssp-buffer-size=4' Log
libcli 1.9.6-1clang: error: argument unused during compilation: '--param ssp-buffer-size=4' [-Werror,-Wunused-command-line-argument] Log
libdbusmenu 0.6.1-2clang: error: argument unused during compilation: '--param ssp-buffer-size=4' Log
libedit 2.11-20080614-5clang: error: argument unused during compilation: '--param ssp-buffer-size=4' Log
libexttextcat 3.2.0-2clang: error: argument unused during compilation: '--param ssp-buffer-size=4' Log
libgconf-bridge 0.1-2.2clang: error: argument unused during compilation: '--param ssp-buffer-size=4' Log
libgphoto2 2.4.14-2clang: error: argument unused during compilation: '--param ssp-buffer-size=4' Log
libindicate 0.6.92-1clang: error: argument unused during compilation: '--param ssp-buffer-size=4' Log 751446
libindicator 0.5.0-1clang: error: argument unused during compilation: '--param ssp-buffer-size=4' Log 751447
libmaa 1.3.1-1clang: error: argument unused during compilation: '--param ssp-buffer-size=4' Log
libmodbus 3.0.3-1clang: error: argument unused during compilation: '--param ssp-buffer-size=4' Log
libosl 0.5.0-1clang: error: argument unused during compilation: '-funswitch-loops' Log
libphone-ui 1:0.0.1+git20110825-2clang: error: argument unused during compilation: '--param ssp-buffer-size=4' Log
libphone-ui-shr 0.1+git20110827-3clang: error: argument unused during compilation: '--param ssp-buffer-size=4' Log
libshevek 1.3-1clang: error: argument unused during compilation: '-ggdb3' Log 754323
libusb 2:0.1.12-23clang: error: argument unused during compilation: '--param ssp-buffer-size=4' Log
libv8 3.8.9.20-1clang: error: argument unused during compilation: '--param ssp-buffer-size=4' Log
libwpd 0.9.4-3clang: error: argument unused during compilation: '--param ssp-buffer-size=4' Log
libxcb 1.8.1-1clang: error: argument unused during compilation: '--param ssp-buffer-size=4' Log
libxs 1.2.0-1clang: error: argument unused during compilation: '--param ssp-buffer-size=4' Log 754324
lio-utils 3.1+git2.fd0b34fd-1clang: error: argument unused during compilation: '-shared' Log
lv2proc 0.4.0-4clang: error: argument unused during compilation: '--param ssp-buffer-size=4' Log
mach 0.9.1-3.1clang: error: argument unused during compilation: '--param ssp-buffer-size=4' Log
mailavenger 0.8.3rc1-1clang: error: argument unused during compilation: '--param ssp-buffer-size=4' Log
massxpert 3.2.3-1clang: error: argument unused during compilation: '--param ssp-buffer-size=4' Log
memcached 1.4.13-0.1clang: error: argument unused during compilation: '--param ssp-buffer-size=4' Log
naspro-bridge-it 0.4.1-1clang: error: argument unused during compilation: '--param ssp-buffer-size=4' Log
naspro-core 0.4.0-3clang: error: argument unused during compilation: '--param ssp-buffer-size=4' Log
nautilus-open-terminal 0.19-2clang: error: argument unused during compilation: '--param ssp-buffer-size=4' Log
network-manager-iodine 0.0.3-1clang: error: argument unused during compilation: '--param ssp-buffer-size=4' Log 754325
network-manager-openconnect 0.9.4.0-7clang: error: argument unused during compilation: '--param ssp-buffer-size=4' Log
network-manager-openvpn 0.9.4.0-1clang: error: argument unused during compilation: '--param ssp-buffer-size=4' Log
network-manager-pptp 0.9.4.0-2clang: error: argument unused during compilation: '--param ssp-buffer-size=4' Log
network-manager-strongswan 1.1.2-2clang: error: argument unused during compilation: '--param ssp-buffer-size=4' Log
network-manager-vpnc 0.9.4.0-1clang: error: argument unused during compilation: '--param ssp-buffer-size=4' Log
ntrack 016-1.1clang: error: argument unused during compilation: '--param ssp-buffer-size=4' Log
ocaml-bitstring 2.0.2-3clang: error: argument unused during compilation: '--param ssp-buffer-size=4' Log
ocaml-libvirt 0.6.1.2-1clang: error: argument unused during compilation: '--param ssp-buffer-size=4' Log 754419
ocl-icd 1.3-2clang: error: argument unused during compilation: '--param ssp-buffer-size=4' Log
open-vm-tools 2:8.8.0+2012.05.21-724730-1clang: error: argument unused during compilation: '--param ssp-buffer-size=4' Log
openocd 0.5.0-1clang: error: argument unused during compilation: '--param ssp-buffer-size=4' Log
openswan 1:2.6.37-3clang: error: argument unused during compilation: '--param ssp-buffer-size=4' Log
pimd 2.1.8-2clang: error: argument unused during compilation: '--param ssp-buffer-size=4' Log
policycoreutils 2.1.10-8clang: error: argument unused during compilation: '--param ssp-buffer-size=4' Log
putty 0.62-8clang: error: argument unused during compilation: '--param ssp-buffer-size=4' Log
qof 0.8.6-1clang: error: argument unused during compilation: '--param ssp-buffer-size=4' Log
qpid-cpp 0.16-6clang: error: argument unused during compilation: '--param ssp-buffer-size=4' Log
qt-at-spi 0.3.1-1clang: error: argument unused during compilation: '--param ssp-buffer-size=4' Log
qtwebkit 2.2.1-4clang: error: argument unused during compilation: '--param ssp-buffer-size=4' Log
radsecproxy 1.6-1clang: error: argument unused during compilation: '--param ssp-buffer-size=4' Log
rampart 1.3.0-3clang: error: argument unused during compilation: '--param ssp-buffer-size=4' Log
realpath 1.17clang: error: argument unused during compilation: '--param ssp-buffer-size=4' Log
reptyr 0.3-2clang: error: argument unused during compilation: '--param ssp-buffer-size=4' Log
sendip 2.5-5clang: error: argument unused during compilation: '--param ssp-buffer-size=4' Log 753846
squid3 3.1.20-1clang: error: argument unused during compilation: '--param ssp-buffer-size=4' Log
subunit 0.0.8+bzr176-1clang: error: argument unused during compilation: '--param ssp-buffer-size=4' Log
superiotool 0.0+r6637-1clang: error: argument unused during compilation: '--param ssp-buffer-size=4' Log
switchsh 0~20070801-3clang: error: argument unused during compilation: '--param ssp-buffer-size=4' Log
systemtap 1.7-1clang: error: argument unused during compilation: '--param ssp-buffer-size=4' Log
taktuk 3.7.4-1clang: error: argument unused during compilation: '--param ssp-buffer-size=4' Log
tempest-for-eliza 1.0.5-1clang: error: argument unused during compilation: '--param ssp-buffer-size=4' Log
theseus 1.6.2-2clang: error: argument unused during compilation: '--param ssp-buffer-size=4' Log
trousers 0.3.9-1clang: error: argument unused during compilation: '--param ssp-buffer-size=4' Log
udisks-glue 1.3.4-1clang: error: argument unused during compilation: '--param ssp-buffer-size=4' Log
upx-ucl 3.08-2clang: error: argument unused during compilation: '--param ssp-buffer-size=4' Log
uwsgi 1.2.3+dfsg-1clang: error: argument unused during compilation: '--param ssp-buffer-size=4' Log
xneur 0.15.0-1.1clang: error: argument unused during compilation: '--param ssp-buffer-size=4' Log 751542
zeromq 2.2.0+dfsg-2clang: error: argument unused during compilation: '--param ssp-buffer-size=4' Log
96 errors
Return to the list