Debian Package rebuild

Rebuild of the Debian archive with clang

"Wrong main declaration" build failure(s)
clang 3.1
Return to the list
main declaration should be:
int main(void);
int main(int argc, char *argv[]);
int main(int argc, char **argv);
int main(int argc, char **argv, char **envp);
and clang refuses the declaration:
main (int argc, char*argv[]) { }
# error: C++ requires a type specifier for all declarations


Versions: 2.9 - 3.0 - 3.1 - 3.2 - 3.3 - 3.4 - 3.4.2 - 3.5.0 - 3.6.0 - 3.8.1
PackageVersionSupposed error messageFull log Bug report
amideco 0.31e-3.1amideco.c:45:5: error: first parameter of 'main' (argument count) must be of type 'int' Log 748818
ann 1.1.2+doc-3ann2fig.cpp:583:1: error: C++ requires a type specifier for all declarations Log 748817
awardeco 0.2-3.1awardeco.c:37:5: error: first parameter of 'main' (argument count) must be of type 'int' Log 748815
emil 2.1.0-beta9.dfsg-1.1conv.c:71:1: error: second parameter of 'main' (argument array) must be of type 'char **' Log
flint 1.011-2QS/mpQS.c:403:5: error: second parameter of 'main' (argument array) must be of type 'char **' Log 743009
fweb 1.62-11.1./t_type.h:53:5: error: second parameter of 'main' (argument array) must be of type 'char **' Log
inventor 2.1.5-10-16ppp.c++:630:1: error: C++ requires a type specifier for all declarations Log
kbuild 1:0.1.9998svn2543-2kmkbuiltin.h:53:12: error: too many parameters (4) for 'main': must be 0, 2, or 3 Log
kdc2tiff 0.35-8kdc2tiff.cpp:308:1: error: C++ requires a type specifier for all declarations Log 748726
konwert 1.8-11.2bin/trs.cc:594:1: error: C++ requires a type specifier for all declarations Log 748725
libgnomeuimm2.6 2.28.0-1iconlist.cc:61:1: error: C++ requires a type specifier for all declarations Log
libxbase 2.0.0-8.5exptest.cpp:136:1: error: C++ requires a type specifier for all declarations Log 748819
netdiag 1.0-20tcpspray.c:74:3: error: first parameter of 'main' (argument count) must be of type 'int' Log 748632
phnxdeco 0.33-3phnxdeco.c:37:5: error: first parameter of 'main' (argument count) must be of type 'int' Log 748630
pretzel 2.0n-2-0.3pretty.nw:232:1: error: C++ requires a type specifier for all declarations Log 748628
re 0.1-5src/re_cmd.c:12:1: error: C++ requires a type specifier for all declarations Log 748420
srf 0.1+dfsg-1testRead.cc:32:1: error: C++ requires a type specifier for all declarations Log 745350
xball 3.0.1-1.1xball.c:28:1: error: first parameter of 'main' (argument count) must be of type 'int' Log 742972
xevil 2.02r2-10serverping.cpp:352:1: error: C++ requires a type specifier for all declarations Log 742968
xjdic 24-8xjdfrontend.c:2587:1: error: second parameter of 'main' (argument array) must be of type 'char **' Log 740227
xjdic 24-8xjdfrontend.c:2587:1: error: second parameter of 'main' (argument array) must be of type 'char **' Log 748419
21 errors
Return to the list