Debian Package rebuild

Rebuild of the Debian archive with clang

"Use of a keyword as dependent template name" build failure(s)
clang 3.2
Return to the list

Versions: 2.9 - 3.0 - 3.1 - 3.2 - 3.3 - 3.4 - 3.4.2 - 3.5.0 - 3.6.0 - 3.8.1
PackageVersionSupposed error messageFull log Bug report
aseprite 0.9.5-2observable.h:42:17: error: use 'template' keyword to treat 'notifyObservers' as a dependent template name Log
assimp 3.0~dfsg-1STEPFile.h:198:64: error: use 'template' keyword to treat 'To' as a dependent template name Log
grantlee 0.1.4-1node.h:195:27: error: use 'template' keyword to treat 'findChildren' as a dependent template name Log
libclaw 1.7.0-3rectangle.tpp:142:16: error: use 'template' keyword to treat 'cast_value_type_to' as a dependent template name Log
libvmime 0.9.1-1../vmime/base.hpp:255:12: error: use 'template' keyword to treat 'dynamicCast' as a dependent template name Log
llvm-2.9 2.9+dfsg-7IntervalMap.h:1973:32: error: use 'template' keyword to treat 'newNode' as a dependent template name Log
llvm-3.0 3.0-10IntervalMap.h:1980:32: error: use 'template' keyword to treat 'newNode' as a dependent template name Log
plee-the-bear 0.6.0-1rectangle.tpp:142:16: error: use 'template' keyword to treat 'cast_value_type_to' as a dependent template name Log
simgear 2.6.0-3ExtendedPropertyAdapter.hxx:49:39: error: use 'template' keyword to treat 'getValue' as a dependent template name Log
skrooge 1.3.0-1node.h:195:27: error: use 'template' keyword to treat 'findChildren' as a dependent template name Log
10 errors
Return to the list