Debian Package rebuild

Rebuild of the Debian archive with clang

"Expected declaration (#define missing?)" build failure(s)
clang 3.2
Return to the list

Versions: 2.9 - 3.0 - 3.1 - 3.2 - 3.3 - 3.4 - 3.4.2 - 3.5.0 - 3.6.0 - 3.8.1
PackageVersionSupposed error messageFull log Bug report
activiz.net 1:1.0~git20111123-6stl_algobase.h:378: error: expected primary-expression before ')' token Log
akonadi 1.7.2-2../../server/src/nepomuk/queryserviceclient.h:81:113: error: expected ')' Log
anytun 0.3.4-2xtime.hpp:23:5: error: expected '}' Log
aqsis 1.8.1-3xtime.hpp:23:5: error: expected '}' Log
aqualung 0.9~beta11-1.2gui_main.c:3237:60: error: expected ';' at end of declaration Log 746195
auto-multiple-choice 1.1.1-2AMC-traitement-image.c:228:28: error: expected ';' at end of declaration Log 746196
autounit 0.20.1-4test.c:305:7: error: expected expression Log 755961
bitcoin 0.7.2-2xtime.hpp:23:5: error: expected '}' Log
bogl 0.1.18-8bogl-font.c:83:23: error: expected ';' at end of declaration Log 758063
clam-networkeditor 1.4.0-3.1xtime.hxx:38:3: error: expected '}' Log
clearsilver 0.10.5-1.3neo_files.c:219:12: error: expected expression Log 755963
dc-qt 0.2.0.alpha-4.1xtime.hpp:23:5: error: expected '}' Log
dcap 2.47.7-1./util.h:14:12: error: expected parameter declarator Log 755964
dietlibc 0.33~cvs20120325-4:2:23: error: expected '@' or '%' before type Log
distcc 3.1-5src/snprintf.h:30:5: error: expected parameter declarator Log
dssp 2.0.4-2xtime.hpp:23:5: error: expected '}' Log
eiskaltdcpp 2.2.6-4stl_stack.h:220:16: error: expected parameter declarator Log 753266
elfutils 0.153-2elf_begin.c:1057:23: error: expected ';' at end of declaration Log 758064
eurephia 1.0.1-3eurephiadm.c:203:46: error: expected ';' at end of declaration Log
fatrat 1.1.3-5xtime.hpp:23:5: error: expected '}' Log
fauhdlc 20120707-1../../frontend/ast/Types.hpp:40:14: error: expected ';' after enum Log
ffindex 0.9.9-2ffindex.c:447:68: error: expected ';' at end of declaration Log 758149
filters 2.48cockney.l:21:12: error: expected ';' at end of declaration Log 758450
freedroidrpg 0.15.1-1quest_browser_ui.c:609:4: error: expected ';' at end of declaration Log 758161
fribidi 0.19.2-3fribidi-char-sets-cap-rtl.c:109:6: error: expected expression Log
gambas3 3.1.1-2gb_error.c:92:26: error: expected ';' at end of declaration Log
gdb-mingw-w64 5../../../upstream/libiberty/../include/libiberty.h:616:12: error: expected parameter declarator Log
gdcm 2.2.1-1stl_algobase.h:378: error: expected primary-expression before ')' token Log
gimp-plugin-registry 5.20120621./refinerThreaded.h:297:25: error: expected ';' at end of declaration Log 758451
gmysqlcc 0.3.0-2gmlc_gui_server_tab_data.c:678:82: error: expected ';' at end of declaration Log 750365
gosmore 0.0.0.20100711-2.1libgosm.cpp:147:53: error: expected ')' Log 756077
gpe-calendar 0.92-4calendars-widgets.c:711:38: error: expected ';' at end of declaration Log
gpsdrive 2.10~pre4-6.dfsg-5.2gpsdrive.c:3383:31: error: expected ';' at end of declaration Log 758452
gtg-trace 0.2+dfsg-1C/paje_GTGBasic1_c.c:14:12: error: expected parameter declarator Log
heimdall-flash 1.4~rc1+dfsg-1source/Arguments.h:135:130: error: expected ')' Log
icinga 1.7.1-5./../include/snprintf.h:29:5: error: expected parameter declarator Log
julia 0.0.0+20130107.gitd9656f41-2toplevel.c:373:5: error: expected parameter declarator Log
kraptor 0.0.20040403-6src/game.c:415:32: error: expected ';' at end of declaration Log 750370
krb5-appl 1:1.0.1-4../k5-platform.h:108:5: error: expected parameter declarator Log
kstars 4:4.8.4-1../../kstars/indi/indielement.h:55:47: error: expected '}' Log
lasso 2.3.6-2tools.c:1208:76: error: expected ';' at end of declaration Log
libeventdb 0.90-5event-db.c:538:33: error: expected ';' at end of declaration Log
libgpevtype 0.50-6vcal.c:43:35: error: expected ';' at end of declaration Log
libhandoff 0.1-5handoff.c:257:21: error: expected ';' at end of declaration Log
libhdate 1.6-1././local_functions.c:672:27: error: expected ';' at end of declaration Log 758453
liborigin2 2:20110117-1xtime.hpp:23:5: error: expected '}' Log
libpam-unix2 1:2.4.1-6read-files.c:344:35: error: expected expression Log
librg-blast-parser-perl 0.03-1blast-parser-driver.h:61:12: error: expected a class or namespace Log
librime 0.9.4-1xtime.hpp:23:5: error: expected '}' Log
libspf2 1.2.9-7spf_compile.c:580:5: error: expected expression Log
libsx 2.05-3popups.c:70:44: error: expected ';' at end of declaration Log 758560
libzeep 2.9.0-2xtime.hpp:23:5: error: expected '}' Log
luvcview 1:0.2.6-6v4l2uvc.c:197:29: error: expected ';' at end of declaration Log 750506
mandos 1.6.0-1plugin-runner.c:425:66: error: expected ';' at end of declaration Log 750516
matchbox-panel 0.9.3-8mb-applet-battery.c:181:41: error: expected ';' at end of declaration Log 750784
mawk 1.3.3-17print.c:85:11: error: expected parameter declarator Log
mcdp 0.4-5cddev.c:61:37: error: expected ';' at end of declaration Log
mcmcpack 1.2-3-1./matrix.h:2179:43: error: expected expression Log
med-fichier 3.0.3-3filterBlockOfentities.c:104:115: error: expected ';' at end of declaration Log 751174
mutrace 0.2.0-2libiberty.h:612:12: error: expected parameter declarator Log
ncpfs 2.2.6-9ncplib.c:2424:51: error: expected ';' at end of declaration Log
netplug 1.2.9.2-1if_info.c:294:36: error: expected ';' at end of declaration Log 750789
ogre 1.7.4+dfsg1-7xtime.hpp:23:5: error: expected '}' Log
ogre-1.8 1.8.0+dfsg1-3xtime.hpp:23:5: error: expected '}' Log
openjdk-6 6b24-1.11.5-1callNative.S:27:21: error: expected '@' or '%' before type Log
p3scan 2:2.3.2-8p3scan.c:2418:83: error: expected ';' at end of declaration Log 750874
partconf 1.40util.c:147:50: error: expected ';' at end of declaration Log
pchar 1.5-1./pc.h:28:15: error: expected '}' Log
pdns 3.1-4./cachecleaner.hh:21:38: error: expected expression Log
pdns-recursor 3.3-3./cachecleaner.hh:21:38: error: expected expression Log
pdp 1:0.12.5-2pdp_xwindow.c:148:23: error: expected ';' at end of declaration Log 758569
pokerth 0.9.5-1xtime.hpp:23:5: error: expected '}' Log
qbittorrent 2.9.8-1xtime.hpp:23:5: error: expected '}' Log
qsapecng 2.0.0-5parser.h:78:41: error: expected ')' Log
rainbow 0.8.6-1nss-rainbow.c:287:38: error: expected ';' at end of declaration Log 758571
rawstudio 2.0-1rs-tag-gui.c:102:102: error: expected ';' at end of declaration Log
rsh-redone 85-1rlogin.c:388:29: error: expected ';' at end of declaration Log 750957
sdl-ball 1.01-3main.cpp:1423:77: error: expected member name or ';' after declaration specifiers Log
sdpa 7.3.8+dfsg-1mexFprintf.c:32:5: error: expected parameter declarator Log
sentinella 0.9.0-3MainWindow.h:70:33: error: expected ';' at end of declaration list Log
siege 2.70-4../include/joedog/joedog.h:92:12: error: expected parameter declarator Log
smbc 1.2.2-3smbc.c:315:38: error: expected ';' at end of declaration Log
spl 1.0~pre6-4spl_modules/mod_array.c:159:48: error: expected ';' at end of declaration Log 741605
swift-im 2.0~beta1+dev47-1xtime.hpp:23:5: error: expected '}' Log
taxbird 0.18-1.1main.c:94:46: error: expected ';' at end of declaration Log
texmaker 3.4-1./texmaker.h:121:67: error: expected member name or ';' after declaration specifiers Log
upstart 1.6.1-1tests/test_initctl.c:3669:34: error: expected ';' at end of declaration Log 737757
vera++ 1.1.1-3xtime.hpp:23:5: error: expected '}' Log
visualboyadvance 1.8.0.dfsg-1debugger.cpp:1725:36: error: expected ')' Log
w-scan 20120605-1descriptors.c:1014:34: error: expected ';' at end of declaration Log 744323
wrapitk-python 3.20.1.5stl_algobase.h:378: error: expected primary-expression before ')' token Log
xfe 1.32.5-1xfeutils.cpp:478:24: error: expected ')' Log
92 errors
Return to the list