Debian Package rebuild

Rebuild of the Debian archive with clang

"Linker error" build failure(s)
clang 3.2
Return to the list

Versions: 2.9 - 3.0 - 3.1 - 3.2 - 3.3 - 3.4 - 3.4.2 - 3.5.0 - 3.6.0 - 3.8.1
PackageVersionSupposed error messageFull log Bug report
0ad 0.0.11-1clang: error: linker command failed with exit code 1 (use -v to see invocation) Log
aesfix 1.0.1-2clang: error: linker command failed with exit code 1 (use -v to see invocation) Log
aeskeyfind 1:1.0-1clang: error: linker command failed with exit code 1 (use -v to see invocation) Log
bash 4.2+dfsg-0.1clang: error: linker command failed with exit code 1 (use -v to see invocation) Log
blacs-pvm 1.1-21clang: error: linker command failed with exit code 1 (use -v to see invocation) Log
cctools 3.5.1-2clang: error: linker command failed with exit code 1 (use -v to see invocation) Log
dcraw 8.99-1clang: error: linker command failed with exit code 1 (use -v to see invocation) Log
dds2tar 2.5.2-4clang: error: linker command failed with exit code 1 (use -v to see invocation) Log
dosbox 0.74-3clang: error: linker command failed with exit code 1 (use -v to see invocation) Log
mupen64plus-core 1.99.5-6clang: error: linker command failed with exit code 1 (use -v to see invocation) Log
mupen64plus-rsp-hle 1.99.5-3clang: error: linker command failed with exit code 1 (use -v to see invocation) Log
mupen64plus-rsp-z64 1.99.4+31+1374ffc147ad-4clang: error: linker command failed with exit code 1 (use -v to see invocation) Log
mupen64plus-ui-console 1.99.5-3clang: error: linker command failed with exit code 1 (use -v to see invocation) Log
mupen64plus-video-arachnoid 1.99.4+39+ada2d63714fd-3clang: error: linker command failed with exit code 1 (use -v to see invocation) Log
mupen64plus-video-rice 1.99.5-3clang: error: linker command failed with exit code 1 (use -v to see invocation) Log
mupen64plus-video-z64 1.99.4+30+daa3f1b2fe76-3clang: error: linker command failed with exit code 1 (use -v to see invocation) Log
python2.7 2.7.3-6clang: error: linker command failed with exit code 1 (use -v to see invocation) Log
python3.2 3.2.3-6clang: error: linker command failed with exit code 1 (use -v to see invocation) Log
rsakeyfind 1:1.0-2.1clang: error: linker command failed with exit code 1 (use -v to see invocation) Log
simhash 0.0.20110213-1clang: error: linker command failed with exit code 1 (use -v to see invocation) Log
splat 1.4.0-2clang: error: linker command failed with exit code 1 (use -v to see invocation) Log
synaesthesia 2.4-3clang: error: linker command failed with exit code 1 (use -v to see invocation) Log
22 errors
Return to the list