Debian Package rebuild

Rebuild of the Debian archive with clang

"Not categorized" build failure(s)
clang 3.2
Return to the list

Versions: 2.9 - 3.0 - 3.1 - 3.2 - 3.3 - 3.4 - 3.4.2 - 3.5.0 - 3.6.0 - 3.8.1
PackageVersionSupposed error messageFull log Bug report
389-dsgw 1.1.9-1../doauth.c:30:5: error: third parameter of 'main' (environment) must be of type 'char **' Log
9base 1:6-6n1.c:124:5: error: unterminated function-like macro invocation Log
aconnectgui 0.9.0rc2-1-9configure: error: Sufficiently new version of libasound not found. Log 684508
aeskulap 0.2.2b1-11./poolinstance.h:53:25: error: no function named 'remove_instance' with type 'void (const Glib::RefPtr &)' was found in the specified scope Log
agave 0.4.7-2.1refptr.h:208:16: error: member access into incomplete type 'gcs::PaletteTreeModel' Log
aplus-fsf 4.22.1-6../MSTypes/MSFloatMatrix.H:30:1: error: template specialization requires 'template<>' Log
apq-postgresql 3.2.0-2Undetected errorLog
apron 0.9.10-5.2ppl.hh:14384:15: error: flexible array member 'vec_' of non-POD element type 'Coefficient []' Log
apt 0.9.7.7Undetected errorLog
apt-cacher-ng 0.7.11-1Undetected errorLog
aqemu 0.8.2-2VM.cpp:4566:75: error: reference to type 'const QString' could not bind to an rvalue of type 'bool' Log
arc-gui-clients 0.3.1-1EntityRetriever.h:23:1: error: template specialization requires 'template<>' Log
arj 3.10.22-10Undetected errorLog
asc 2.4.0.0-3movementtest.cpp:23:4: error: right operand to ? is void, but left operand is of type 'int' Log
aspectc++ 1:1.1+svn20120529-2limits.h:36: error: unexpected token `(' in conditional Log
aster 10.6.0-1-4Undetected errorLog
atlas 3.8.4-9dasum.c:179:5: error: "This kernel requires SSE2" Log
atlas-cpp 0.6.2-3Undetected errorLog
atom4 4.1-5.1engine/ai.cc:343:1: error: control reaches end of non-void function [-Werror,-Wreturn-type] Log 710408
ats-lang-anairiats 0.2.9-1Undetected errorLog
audiofile 0.3.4-2Undetected errorLog
augeas 1.0.0-1Undetected errorLog
avifile 1:0.7.48~20090503.ds-12common/avm_output.cpp:20:12: error: qualified reference to 'AvmOutput' is a constructor name rather than a type wherever a constructor can be declared Log
ax25-tools 0.0.10-rc2+cvs20120204-3./rip98d.h:47:12: error: restrict requires a pointer or reference Log
ball 1.4.1+20111206-4global.h:39:38: error: token is not a valid binary operator in a preprocessor subexpression Log 755225
blackbox 0.70.1-15Undetected errorLog
blacs-mpi 1.1-31blacsF77init_MPI-LINUX-0.a: could not read symbols: Archive has no index; run ranlib to add one Log
blas 1.2.20110419-5Undetected errorLog
blktap 2.0.90-1libvhd.c:1073:2: error: indirection of non-volatile null pointer will be deleted, not trap [-Werror,-Wnull-dereference] Log
boolstuff 0.1.13-1configure: error: this program requires the ISO C++ standard library Log
botan1.10 1.10.3-1Undetected errorLog
btag 1.1.3-1Undetected errorLog
busybox 1:1.20.0-7findutils/find.c:904:2: error: illegal storage class on function Log
cadabra 1.29-1./youngtab.hh:587:23: error: use of non-static data member 'rows' of 'filled_tableau' from nested type 'iterator' Log
cbmc 4.2-6lex.yy.cpp:3282:16: error: function 'yyinput' is not needed and will not be emitted [-Werror,-Wunneeded-internal-declaration] Log
cegui-mk2 0.7.6-2../../cegui/include/CEGUIWindowFactoryManager.h:486:9: error: cannot catch reference to incomplete type 'CEGUI::Exception' Log
ceph 0.48-1./include/interval_set.h:90:35: error: no class named 'const_iterator' in 'interval_set' Log 749083
charybdis 3.3.0-7.1sigio.c:238:17: error: variable has incomplete type 'struct siginfo' Log
clthreads 2.4.0-4Undetected errorLog
clxclient 3.6.1-6Undetected errorLog
cmake 2.8.9-1Undetected errorLog
cmdpack 1.03-1src/banner.h:7:2: error: embedding a #include directive within macro arguments is not supported Log
coinor-dylp 1.6.0-1.1configure: error: /bin/bash './configure' failed for DyLP Log
coinor-flopc++ 1.0.6-3.1./MP_domain.hpp:180:18: error: return type of virtual function 'getSet' is not covariant with the return type of the function it overrides ('flopc::MP_set_base' is incomplete) Log
comedilib 0.10.0-3Undetected errorLog
condor 7.8.2~dfsg.1-1+deb7u1HashTable.h:264:23: error: invalid operands to binary expression ('ThreadInfo' and 'const ThreadInfo') Log
cook 2.33-1Undetected errorLog
coriander 2.0.1-1configure: error: The XV overlay libraries were not found Log
cpl 6.1.1-2cpl_column.c:12926:29: error: cannot compile this complex compound assignment yet Log
cppcheck 1.58-1Undetected errorLog
cpuburn 1.4a-3burnK7.S:83:10: error: unexpected token in '.fill' directive Log
crrcsim 0.9.12-5Undetected errorLog
csound 1:5.17.11~dfsg-2Undetected errorLog
cups 1.5.3-2.14Undetected errorLog
cvc3 2.4.1-4configure: error: libgmp.a is not found. Log
cxxtools 2.1.1-1configure: error: iconv not found Log
cython 0.15.1-2Undetected errorLog
d-itg 2.8.1~rc1-1common/timestamp.h:65:17: error: field has incomplete type 'struct timeval' Log
dacs 1.4.27b-2Undetected errorLog
dar 2.4.8-1configure: error: Cannot find size_t type Log
darcs-monitor 0.3.8-2unsatisfiable build-dependency: libghc6-haxml-dev (< 1:1.14) but 1:8 is to be installed Log
db 5.1.29-5configure: error: no Log
db4.8 4.8.30-12libtool.m4: error: problem compiling CXX test program Log
db5.3 5.3.15-4configure: error: no Log
dcmtk 3.6.0-12stddef.h:35:33: error: typedef redefinition with different types ('typeof (sizeof(int))' (aka 'unsigned long') vs 'unsigned int') Log
debconf-kde 0.2-2Undetected errorLog
dehydra 0.9.hg20120525-1Undetected errorLog
dicom3tools 1.0~20121227-1./Imakefile:163:3: error: invalid preprocessing directive Log
dictconv 0.2-7configure: error: You must have libxml2 >= 2.5.0 installed Log
dmapi 2.2.10-1Undetected errorLog
dolfin 1.0.0-7ErrorControl.h:195:40: error: no function named 'adapt' with type 'const dolfin::ErrorControl &(const dolfin::ErrorControl &, boost::shared_ptr, bool)' was found in the specified scope Log
drawtiming 0.7.1-5Undetected errorLog
drizzle 1:7.1.36-stable-1drizzled/cursor.cc:1334:7: error: unknown flag Log
dvdisaster 0.72.4-1Undetected errorLog
ember 0.6.2+dfsg-2CEGUIWindowFactoryManager.h:486:9: error: cannot catch reference to incomplete type 'CEGUI::Exception' Log
enblend-enfuse 4.0+dfsg-4configure: error: Boost "pool" header file is required to compile Enblend. Log
enigma 1.10~~pre-alpha+r2236-1./ecl_dict.hh:134:27: error: calling a private constructor of class 'ecl::XInvalidKey' Log
eris 1.3.19-5Undetected errorLog
estic 1.61-20.1./coll.h:317:7: error: invalid operands to binary expression ('Stream' and 'u32' (aka 'unsigned int')) Log
esys-particle 2.1-4./SphAggGougeBlock.hpp:39:37: error: no viable conversion from '__normal_iterator' to '__normal_iterator' Log
feel++ 0.91.4-3Undetected errorLog
fftw3 3.3.2-3.1configure: error: don't know how to enable OpenMP Log
firebird2.1 2.1.5.18496-0.ds2-1../src/include/../common/classes/alloc.h:434:14: error: exception specification in declaration does not match previous declaration Log
fltk1.1 1.1.10-14Undetected errorLog 755228
fltk1.3 1.3.0-8Undetected errorLog 755229
freefoam 0.1.0+dfsg-1Pstream.H:518:29: error: no function named 'reduce' with type 'void (scalar &, const sumOp &)' was found in the specified scope Log
freetype 2.4.9-1.1ttload.c:550:9: error: using extended field designator is an extension [-Werror,-Wextended-offsetof] Log
fsvs 1.2.3-0+nmu1configure: error: You have a sparse S_IFMT. Please tell the dev@ mailing list. Log
fwbuilder 5.1.0-3CompilerDriver_ipt_run.cpp:655:16: error: invalid operands to binary expression ('QTextStream' and '') Log
g15daemon-audacious 2.5.7-4configure: error: Cannot find glib2/gtk2/pango Log
gap 4r4p12-2Undetected errorLog
gauche-c-wrapper 0.6.1-5clang: error: unable to execute command: Broken pipe Log
gbsplay 0.0.91-1Undetected errorLog
gcc-3.3 1:3.3.6ds1-25Undetected errorLog
gcc-h8300-hms 1:3.4.6+dfsg-1./gtype-cp.h:431:14: error: duplicate case value '0' Log
gcc-mingw-w64 8configure: error: GNAT is required to build ada Log
gcc-snapshot 20130123-1configure: error: GNAT is required to build ada Log
gdb-msp430 7.2a~mspgcc-20111205-1bfdio.c:580:31: error: 'memset' call operates on objects of type 'struct stat' while the size is based on a different type 'struct stat *' [-Werror,-Wsizeof-pointer-memaccess] Log
gecode 3.7.3-1Undetected errorLog
gegl 0.2.0-2+nmu1Undetected errorLog
gem 1:0.93.3-5configure: error: GLU (headers) not found! you need openGL Utility Library!!! Log
genparse 0.9.1-1Undetected errorLog
geotranz 3.2-1Undetected errorLog
gerris 20110329-dfsg.2-1configure: error: Log
gfal2 2.0.0-1Undetected errorLog
gforth 0.7.0+ds2-0.1make[1]: emacs: Command not found Log
giftrans 1.12.2-17Undetected errorLog
glibmm2.4 2.32.1-1Undetected errorLog
glob2 0.9.4.4-2.1Undetected errorLog
gltron 0.70final-10vector.c:244:2: error: passing 'const char [83]' to parameter of type 'char *' discards qualifiers [-Werror,-Wincompatible-pointer-types] Log
gmerlin 1.2.0~dfsg+1-1bgyadif.c:769:9: error: ambiguous instructions require an explicit suffix (could be 'cmpb', 'cmpw', 'cmpl', or 'cmpq') Log
gmp 2:5.0.5+dfsg-2tmp-mod_1_4.s:167:7: error: ambiguous instructions require an explicit suffix (could be 'subb', 'subw', 'subl', or 'subq') Log
gnash 0.8.11~git20120629-1agg_scanline_u.h:476:30: error: type 'base_type' (aka 'agg::scanline_u8') is not a direct or virtual base of 'scanline32_u8_am' Log
gnat-4.4 4.4.6-6unsatisfiable build-dependency: gcc-4.4-source (< 4.4.7) but 4.4.7-3 is to be installed Log
gnat-4.6 4.6.3-8configure: error: GNAT is required to build ada Log
gnome-scan 0.6.2-1.1unsatisfiable build-dependency: libgegl-0.0-dev (>= 0.0.21) (versioned dep on a virtual pkg?) Log
gnucap 1:0.36~20091207-2./mg_.h:134:19: error: variable has incomplete type 'C_Comment' Log
gnustep-base 1.22.1-4configure: error: Could not find Objective-C headers Log
google-glog 0.3.2-4Undetected errorLog
google-perftools 2.0-4src/base/linuxthreads.cc:312:22: error: assigning to 'void (*)(int, struct siginfo *, void *)' from incompatible type 'void (int, siginfo_t *, void *)': type mismatch at 2nd parameter ('struct siginfo *' vs 'siginfo_t *') Log
goplay 0.5-1.1engine.h:153:24: error: calling a protected constructor of class 'wibble::commandline::OptionGroup' Log 753645
gpdftext 0.1.5-1pdf.c:107:36: error: implicit conversion from 'double' to 'int' changes value from 1.5 to 1 [-Werror,-Wliteral-conversion] Log
gpick 0.2.4-1Undetected errorLog
gprolog 1.3.0-6.1Undetected errorLog
granule 1.4.0-7-1Granule.cpp:59:1: error: extraneous 'template<>' in declaration of variable 'm_default_entity_loader' Log
graphicsmagick 1.3.16-1.1dh_install: libgraphicsmagick++3 missing files (usr/lib/libGraphicsMagick++.so.*), aborting Log
graphthing 1.3.2-3.1configure: error: no functional stringstream Log
grcompiler 4.2-1Undetected errorLog
groff 1.22.1-2Undetected errorLog
grub 0.97-67configure: error: GRUB requires GAS .code16 addr32 support; upgrade your binutils Log
grub2 1.99-27configure: error: gcc-4.6 failed to produce assembly code Log
gsoap 2.8.7-2Undetected errorLog
gst-plugins-ugly0.10 0.10.19-2dh_install: gstreamer0.10-plugins-ugly missing files (debian/tmp/usr/lib/*/gstreamer-0.10/libgstsid.so), aborting Log
gst-plugins-ugly1.0 1.0.5-1dh_install: gstreamer1.0-plugins-ugly missing files (debian/tmp/usr/lib/*/gstreamer-1.0/libgstsid.so), aborting Log
guile-1.6 1.6.8-10.3Undetected errorLog
guile-1.8 1.8.8+1-8Undetected errorLog
guile-2.0 2.0.5+1-3Undetected errorLog
guile-gnome-platform 2.16.2-1Undetected errorLog
guppy 0.1.9-2ImportError: guppy/sets/setsc.so: undefined symbol: _PyLong_AsScaledDouble Log
guymager 0.6.7-3aewf.cpp:126:12: error: field has incomplete type 'uint []' Log
hardening-wrapper 2.3Undetected errorLog
htmlcxx 0.85-2Undetected errorLog
hugs98 98.200609.21-5.3tools/make_bootlib: 68: tools/make_bootlib: -D__HUGS__: not found Log
hwinfo 16.0-2.2./AsmMacros.h:366:24: error: invalid operand in inline asm: 'in${0:B} ($1)' Log
hylafax 3:6.0.6-4Undetected errorLog
ibus-qt 1.3.1-2.1qibusserializable.h:94:59: error: non-const lvalue reference to type 'QVariant' cannot bind to a temporary of type 'QVariant' Log
iceape 2.7.12-1../../../../mozilla/js/src/jsapi.h:1761:1: error: 'JS_GetNaNValue' has C-linkage specified, but returns user-defined type 'jsval' (aka 'JS::Value') which is incompatible with C [-Werror,-Wreturn-type-c-linkage] Log
icecc 0.9.7-5workit.cpp:475:31: error: variable has incomplete type 'struct rusage' Log
icedove 10.0.12-1./jsapi.h:1761:1: error: 'JS_GetNaNValue' has C-linkage specified, but returns user-defined type 'jsval' (aka 'JS::Value') which is incompatible with C [-Werror,-Wreturn-type-c-linkage] Log
iceweasel 10.0.12esr-1../../../js/src/jsapi.h:1761:1: error: 'JS_GetNaNValue' has C-linkage specified, but returns user-defined type 'jsval' (aka 'JS::Value') which is incompatible with C [-Werror,-Wreturn-type-c-linkage] Log
icewm 1.3.7-4../../src/apppstatus.cc:85:5: error: cannot delete expression of type 'YColor *[3]' Log
icu 4.8.1.1-10Undetected errorLog
imvirt 0.9.4-4vmware.c:67:5: error: invalid operand for instruction Log
iptux 0.5.3-1AnalogFS.cpp:160:23: error: assigning to 'struct entry *' from incompatible type 'struct entry *' Log
ivtools 1.2.10a1-1Undetected errorLog
jellyfish 1.1.5-1./jellyfish/err.hpp:42:7: error: ignoring return value of function declared with warn_unused_result attribute [-Werror,-Wunused-result] Log 749136
jovie 4:4.8.4-2componentfactory.h:84:62: error: calling a private constructor of class 'QString' Log
jscoverage 0.5.1-2configure: error: ./configure.gnu failed for js Log
jthread 1.3.1-3Undetected errorLog
k3d 0.8.0.2-18image_view_factory.hpp:151:43: error: invalid use of incomplete type 'boost::gil::default_color_converter' Log
kamera 4:4.8.4-2Undetected errorLog
kaya 0.4.4-6Undetected errorLog
kbibtex 0.4-4Undetected errorLog 753270
kde4libs 4:4.8.4-4Undetected errorLog
kicad 0.20120526+bzr3261-1clone_allocator.hpp:34:22: error: allocating an object of abstract class type 'LIB_ITEM' Log
kiwix 0.9~beta6.8-1configure: error: cannot find zlib header Log
kmetronome 0.10.1-1Undetected errorLog
kmouth 4:4.8.4-3componentfactory.h:84:62: error: calling a private constructor of class 'QString' Log
kphotoalbum 4.2-1componentfactory.h:84:62: error: calling a private constructor of class 'QString' Log
kplayer 1:0.7-2.1kplayernode.cpp:2401:5: error: unexpected ':' in nested name specifier; did you mean '::'? Log
krusader 1:2.4.0~beta1+git76+de1ea35-1.1checksumdlg.cpp:53:91: error: default arguments can only be specified for parameters in a function declaration Log
kwave 0.8.8-1-3Undetected errorLog
laserboy 2012.11.11-1LaserBoy_frame_set.hpp:259:38: error: parameter of overloaded 'operator++' cannot have a default argument Log
lcdf-typetools 2.92-2Undetected errorLog
lcgdm 1.8.2-1Undetected errorLog
lcmaps-plugins-voms 1.5.5-2configure: error: "no working voms found" Log
libapache2-mod-perl2 2.0.7-2Undetected errorLog
libavg 1.7.1-1../../../src/graphics/GLContext.h:54:38: error: type 'const avg::GLConfig' does not provide a call operator Log
libb-hooks-parser-perl 0.11-1Undetected errorLog
libcmis 0.1.0-1cmis-client.cxx:137:13: error: delete called on 'libcmis::Session' that is abstract but has non-virtual destructor [-Werror,-Wdelete-non-virtual-dtor] Log
libcrypto++ 5.6.1-6gcm.cpp:746:3: error: unexpected token after + Log
libdap 3.11.1-12Undetected errorLog
libev-perl 4.11-2./libev/ev.c:1254:31: error: static declaration of 'ev_default_loop_ptr' follows non-static declaration Log
libgooglepinyin 0.1.2-1Undetected errorLog
libimobiledevice 1.1.1-4ld: .libs/libimobiledevice.so.2.0.1: hidden symbol `debug_buffer' isn't defined Log
libitpp 4.2-4Undetected errorLog
libjdic-java 0.9.5-7Undetected errorLog
libktorrent 1.2.1-1Undetected errorLog
liblognorm 0.3.5-1Undetected errorLog
libmediainfo 0.7.58-1Undetected errorLog
libmodplug 1:0.8.8.4-3clang: error: unable to execute command: Aborted Log
libmusicbrainz5 5.0.1-2Undetected errorLog
liboil 0.3.17-2wavelet.c:1759:27: error: invalid use of a cast in a inline asm context requiring an l-value: remove the cast or build with -fheinous-gnu-extensions Log
libomxcamera 0.1-2configure:3314: error: in `/«PKGBUILDDIR»': Log
libomxfbdevsink 0.1-2configure:3313: error: in `/«PKGBUILDDIR»': Log
libomxvideosrc 0.1-1configure:3314: error: in `/«PKGBUILDDIR»': Log
libomxvorbis 0.1-3configure:3321: error: in `/«PKGBUILDDIR»': Log
libopendbx 1.4.6-3Undetected errorLog
libopenraw 0.0.9-3Undetected errorLog
libpgf 6.12.24+ds1-2Undetected errorLog
libphash 0.9.4-1.2CImg.h:27246:18: error: declaration of 't' shadows template parameter Log
libpinyin 0.6.91-1Undetected errorLog
libqt4pas 2.5-7Undetected errorLog
libraw 0.14.6-2Undetected errorLog
libtemplates-parser 11.6-2Undetected errorLog
libtext-hunspell-perl 2.05-1Undetected errorLog
libvigraimpex 1.7.1+dfsg1-3rf_split.hxx:156:26: error: variable has incomplete type 'vigra::CompileTimeError' Log
libvirt 0.9.12-6Undetected errorLog
libwx-perl 1:0.9911-1Undetected errorLog
libwx-scintilla-perl 0.38-1Undetected errorLog
libxml++2.6 2.34.2-1configure: error: required headers not found Log
libzen 0.4.27-2Undetected errorLog
lierolibre 0.5-1src/gvl/io/encoding.hpp:586:19: error: cast from pointer to smaller type 'uint32_t' (aka 'unsigned int') loses information Log
lightspark 0.6.0.1-2Undetected errorLog
lilypond 2.14.2-3Undetected errorLog
linbox 1.1.6~rc0-4.2Undetected errorLog
linux 3.2.35-2rcupdate.h:808:2: error: array size is negative Log
linux-tools 3.2.17-1Undetected errorLog
logkeys 0.1.1a-3configure: error: Expected header file is missing! Log
lordsawar 0.2.0-2.1armyproto.cpp:39:34: error: array initializer must be an initializer list Log
ltrace 0.5.3-2.1ld: warning: cannot find entry symbol _start; defaulting to 0000000000400180 Log
lurker 2.3-3configure: error: Need zlib.h to compile Log
lyx 2.0.3-3Undetected errorLog
lzip 1.13-4Undetected errorLog
lziprecover 1.13-3Undetected errorLog
maqview 0.2.5-4Undetected errorLog
mcl 1:12-068-1matrix.c:1847:1: error: parameter name omitted Log
mecab 0.99.3-3configure: error: Your compiler is not powerful enough to compile MeCab. If it should be, see config.log for more information of why it failed. Log
megaglest 3.6.0.3-1.2Undetected errorLog
memtest86 4.0s-1main.c:102:2: error: indirect goto in function with no address-of-label expressions Log
memtest86+ 4.20-1.1DEPS Log
mesa 8.0.5-3nouveau_array.c:49:16: error: illegal storage class on function Log
mingw32-binutils 2.20-0.2i386-dis.c:6671:21: fatal error: parser recursion limit reached, program too complex Log
mknbi 1.4.4-9Undetected errorLog
mlt 0.8.0-4./vf_yadif_template.h:228:9: error: ambiguous instructions require an explicit suffix (could be 'cmpb', 'cmpw', 'cmpl', or 'cmpq') Log
mm3d 1.3.7-1.4configure: error: Failed to link Qt with OpenGL support. Log
mongodb 1:2.2.2-1Undetected errorLog
mono 2.10.8.1-6Undetected errorLog
mpich2 1.4.1-4.1configure: error: Cannot build shared libraries with this compiler Log
mrpt 1:0.9.6-1math_frwds.h:154:157: error: calling 'lightFromPose' with incomplete return type 'mrpt::math::TPoint2D' Log
mtbl 0.2-1src/mtbl_merge.c:67:1: error: static declaration of 'timespec_get' follows non-static declaration Log
mumble 1.2.3-349-g315b5f5-2.2OSS.cpp:237:3: fatal error: goto into protected scope Log 753273
museek+ 1:0.2+svn20100315.r1208-2DEPS Log
natlog 0.91.0-3showseconds/showseconds2.cc:5:15: error: no viable conversion from 'FBB::X2a' to 'std::basic_string' Log
ncbi-blast+ 2.2.27-3configure: error: cannot compute sizeof (size_t), 77 Log
netsurf 2.9-2Undetected errorLog
nget 0.27.1-11./par2/par2fileformat.h:89:25: error: flexible array member 'entries' of non-POD element type 'FILEVERIFICATIONENTRY []' Log
ninja-build 1.0.0-2Undetected errorLog
nn 6.7.3-8make[2]: *** No rule to make target ` articles.h', needed by `nn.o'. Stop. Log
node-expat 1.6.0-2/bin/sh: 1: node: not found Log
nodejs 0.6.19~dfsg1-6wscript:475: error: Cannot find c-ares Log
nordugrid-arc 2.0.1-1../../../../include/arc/client/../../../src/hed/libs/client/EntityRetriever.h:23:1: error: template specialization requires 'template<>' Log
npapi-vlc 2.0.0-2./control/nporuntime.h:226:13: error: static declaration of 'RuntimeNPClassGetProperty' follows non-static declaration Log
obby 0.4.8-1../inc/zeroconf_avahi.hpp:135:40: error: assigning to 'AvahiWatchEvent' from incompatible type 'int' Log
ocropus 0.3.1-4configure: error: Could not find tesseract! Choose --without-tesseract if you do not want to use it. Log
octave 3.6.2-5../liboctave/eigs-base.cc:3837:1: error: explicit instantiation cannot have a storage class Log
omnievents 1:2.6.2-2configure: error: Cannot find socket libraries Log
open-cobol 1.1-1Undetected errorLog
opencity 0.0.6.4stable-1.1../../src/destination.h:25:6: error: redeclaration of already-defined enum 'OPENCITY_DIRECTION' is a GNU extension [-Werror,-Wgnu] Log
openvpn-auth-ldap 2.0.3-5configure: error: Can't locate Objective C runtime headers Log
otcl 1.14+dfsg-2tclInt.h:54:13: error: typedef redefinition with different types ('int' vs 'typeof (((int *)0) - ((int *)0))' (aka 'long')) Log
pam 1.1.3-7.1pam_unix_acct.c:97:19: error: variable has incomplete type 'struct rlimit' Log
pathfinder 1.1.3-0.4wvscatterhash.h:186:46: error: invalid use of non-static data member 'xstatus' Log
pcp 3.6.5access.o: r .L.str : Error: additional symbol Log
pdftk 1.44-7PdfStream.java:242: error: PdfEncryption cannot be resolved to a type Log
phonon 4:4.6.0.0-3Undetected errorLog
pingus 0.7.6-1.1src/lisp/getters.hpp:33:15: error: no viable conversion from 'std::shared_ptr' to 'const lisp::Lisp *' Log
pion-net 4.0.7+dfsg-3.1configure: error: Unable to link with the boost::thread library Log
plzip 0.9-3Undetected errorLog
polkit-qt-1 0.103.0-1Undetected errorLog
polybori 0.5~rc1-2.2polybori/include/CDDManager.h:281:28: error: 'mutable' cannot be applied to references Log
portabase 2.1+git20120910-1configure: error: cannot compute sizeof (long), 77 Log
posh 0.11jobs.c:1181:16: error: variable has incomplete type 'struct rusage' Log
postgresql-9.1 9.1.7-1configure: error: thread test program failed Log
ppl 1:0.11.2-9Undetected errorLog
prison 1.0+dfsg-1Undetected errorLog
proftmb 1.1.12-1Undetected errorLog
psi 0.14-3Undetected errorLog
putty 0.62-9../timing.c:54:15: error: ordered comparison of function pointers ('timer_fn_t' (aka 'void (*)(void *, long)') and 'timer_fn_t') [-Werror] Log
python-enable 4.1.0-1clang: error: no input files Log
python-event 0.3+svn60-3Undetected errorLog
pywavelets 0.2.0-5ImportError: /«PKGBUILDDIR»/build/lib.linux-x86_64-2.7/pywt/_pywt.so: undefined symbol: float_swt_ Log
pyxine 0.1alpha2-7pyxine/libxine_wrap.c:3141:2: error: invalid preprocessing directive Log
qapt 1.3.0-2Undetected errorLog
qca2 2.0.3-4Undetected errorLog
qdbm 1.8.78-2./xadbm.h:75:19: error: out-of-line declaration of a member must be a definition [-Wout-of-line-declaration] Log
qgis 1.7.4+1.7.5~20120320-1.1Tools.h:418:35: error: no function named 'operator<<' with type 'std::ostream &(std::ostream &, const Tools::PropertySet &)' was found in the specified scope Log
qjackctl 0.3.9-2Undetected errorLog
qt-gstreamer 0.10.2-2Undetected errorLog
quisk 3.6.6-1quisk.c:1720:4: error: cannot compile this complex compound assignment yet Log
r-cran-xml 3.95-0.1-1Undetected errorLog
rampart 1.3.0-3error.c:91:5: error: implicitly declaring library function 'vsnprintf' with type 'int (char *, unsigned long, const char *, __va_list_tag *)' [-Werror] Log
reprepro 4.12.5-1sourceextraction.c:133:2: error: illegal storage class on function Log
rheolef 6.1-2.1iorheo.cc:192:16: error: explicit instantiation of 'rheolef::iorheobase_memory_handler' must occur in namespace 'rheolef' Log
rtmidi 1.0.15~ds0-2RtMidi.cpp:2488:15: error: 'long long type-name' is invalid Log
ruby1.8 1.8.7.358-6Undetected errorLog
saga 2.0.8+dfsg-3table.cpp:128:17: error: taking the address of a temporary object of type 'CSG_Table' [-Waddress-of-temporary] Log
samhain 2.8.3a-1./src/sh_tiger1_64.c:375:3: error: ran out of registers during register allocation Log
sbnc 1.2-26./../Object.h:163:14: error: 'CUser' is an incomplete type Log
schroot 1.6.4-4configure: error: Boost.shared_ptr (Boost C++ Libraries) is not installed, but is required by schroot Log
scim-thai 0.1.3-1dh_install: scim-thai missing files (usr/lib/scim-1.0/*/IMEngine/*.so), aborting Log
scscp-imcce 0.7.1+ds-2Undetected errorLog
setools 3.3.7-3.3Undetected errorLog
shiboken 1.1.1-1Undetected errorLog
simage 1.7.0-1.1configure: error: aborting Log
simgrid 3.8.1-2Undetected errorLog
sinfo 0.0.46-2bind.hpp:69:22: error: type 'void (*)(int) __attribute__((noreturn))' cannot be used prior to '::' because it has no members Log
sks-ecc 0.93-2tfm/mpi.c:2565:15: error: unknown register name '%cc' in asm Log
skstream 0.3.8-1Undetected errorLog
slang-slirp 1.9.8-1.1configure: error: unable to find the slang library and header file slang.h Log
sleuthkit 3.2.3-2Undetected errorLog
smlsharp 1.2.0-1016.s:4714:22: error: invalid character in input Log
smokeqt 4:4.8.4-1Undetected errorLog
socat 1.7.1.3-1.4./xio.h:356:4: error: "unexpected size of off_t, please report this as bug" Log
sslsniff 0.8-3configure: error: libboost-thread1.35-dev library is not installed. Log
stalin 0.11-5Undetected errorLog
starpu 1.0.1-2dh_install: libstarpu-dev missing files (usr/lib/starpu/*/gcc/*/*.so*), aborting Log
styx 1.8.0-1.1sysbase1.c:524:50: error: invalid token at start of a preprocessor expression Log
subtitlecomposer 0.5.3-3scripting_subtitle.cpp:68:13: error: calling a private constructor of class 'SubtitleComposer::Scripting::SubtitleLine' Log
subtle 0.11.3224-xi-1src/subtle/panel.c:265:41: error: initializer overrides prior initialization of this subobject [-Werror,-Winitializer-overrides] Log
subvertpy 0.8.10-2Undetected errorLog
taglib 1.7.2-1Undetected errorLog
tcc 0.9.26~git20120612.ad5f375-6libtcc1.c:673:45: error: too few arguments provided to function-like macro invocation Log
tclcl 1.20-6Undetected errorLog
tclex 1.2a1-15tclInt.h:54:13: error: typedef redefinition with different types ('int' vs 'typeof (((int *)0) - ((int *)0))' (aka 'long')) Log
tdb 1.2.10-2Undetected errorLog
telepathy-qt 0.9.1-4Undetected errorLog
tevent 0.9.16-1Undetected errorLog
theseus 1.6.2-2msa.c:80:5: error: ignoring return value of function declared with warn_unused_result attribute [-Werror,-Wunused-result] Log
ticcutils 0.3-1configure: error: We need pthread support! Log
tiobench 0.3.3-5tiotest.c:34:15: error: static declaration of 'aligned_alloc' follows non-static declaration Log
tk707 0.7.21-9.1configure: error: Sufficiently new version of libasound not found. Log
tntdb 1.2-2configure: error: cxxtools headers not found Log
tntnet 2.1-2configure: error: zlib not found Log
torcs 1.3.3+dfsg-0.1configure: error: Can't find GL/glut.h. freeglut can be found on http://freeglut.sourceforge.net/ Log
tpb 0.6.4-8Undetected errorLog
traverso 0.49.2-5Tsar.h:66:9: error: field has incomplete type 'void *[]' Log
triggerhappy 0.3.4-2make[1]: *** No rule to make target `evtable_EV.h', needed by `eventnames.o'. Stop. Log
troffcvt 1.04-21Undetected errorLog
tudu 0.8.2-1Undetected errorLog
user-mode-linux 3.2-2um-1include/linux/rcupdate.h:808:2: error: array size is negative Log
uwsgi 1.2.3+dfsg-5./uwsgi.h:1667:22: error: field 'wsgi_req' with variable sized type 'struct wsgi_request' not at the end of a struct or class is a GNU extension [-Werror,-Wgnu] Log
vdr-plugin-xineliboutput 1.0.7+cvs20120609.1902-1make[2]: *** No rule to make target `dbus/dbus-glib.h', needed by `tools/gnome_screensaver.o'. Stop. Log
wavpack 4.60.1-3extra2.c:85:41: error: passing 'int' to parameter of incompatible type '__attribute__((__vector_size__(1 * sizeof(long long)))) long long' Log
wvdial 1.61-4.1uniconfgen.h:323:19: error: no class named 'Iter' in 'UniConfGen' Log
wvstreams 4.6.1-5./include/wvscatterhash.h:186:46: error: invalid use of non-static data member 'xstatus' Log
xapian-core 1.2.12-2configure: error: zlib.h not found - required for brass, chert and flint (you may need to install the zlib1g-dev or zlib-devel package) Log
xbmc 2:11.0~git20120510.82388d5-1cpluff.c:80:35: error: too many arguments provided to function-like macro invocation Log
xboard 4.6.2-1Undetected errorLog
xcftools 1.0.7-4Undetected errorLog
xcp-vncterm 0.1-2main.c:545:19: error: variable has incomplete type 'struct rlimit' Log
xdb 1.2.0-7.2dh_install: libxdb1 missing files (debian/tmp/usr/lib/*.so.*), aborting Log
xen 4.1.4-1Undetected errorLog
xen-api 1.3.2-14x86_64.h:201:47: error: 'aligned' attribute ignored when parsing type Log
xerces-c 3.1.1-3configure: error: Couldn't find a signed 16 bit int type Log
xine-lib 1.1.21-1configure: error: Pthread support is needed Log
xine-lib-1.2 1.2.2-4configure: error: Pthread support is needed Log
xsd 3.3.0.1-1.3static-ptr.hxx:63:28: error: cannot allocate function type 'Cult::MM::KeyList ()' with new Log
yade 0.80.1-2debian/build/include/yade/lib/base/Math.hpp:333:5: error: taking the address of a temporary object of type 'const nvp' [-Waddress-of-temporary] Log
yorick-av 0.0.1-2Undetected errorLog
z80ex 1.1.20-1dh_install: libz80ex-dev missing files (usr/lib/lib*.a), aborting Log
zoneminder 1.25.0-3configure: error: zm requires gnutls/openssl.h - use ZM_SSL_LIB option to select openssl instead Log
zoo 2.10-27clang: error: unable to execute command: Aborted Log
zvbi 0.2.33-6./misc.h:56:5: error: invalid token at start of a preprocessor expression Log
zzuf 0.13.svn20100215-4Undetected errorLog
365 errors
Return to the list