Debian Package rebuild

Rebuild of the Debian archive with clang

"No matching function call" build failure(s)
clang 3.2
Return to the list

Versions: 2.9 - 3.0 - 3.1 - 3.2 - 3.3 - 3.4 - 3.4.2 - 3.5.0 - 3.6.0 - 3.8.1
PackageVersionSupposed error messageFull log Bug report
dbus-c++ 0.9.0-6../../include/dbus-c++/dispatcher.h:259:5: error: no matching function for call to '_init_threading' Log
dragonegg 3.1-3Backend.cpp:452:7: error: no matching function for call to 'fast_math_flags_set_p' Log
imagevis3d 3.0.0-1IO/IOManager.cpp:2511:19: error: no matching function for call to 'bind' Log
libffado 2.0.99+svn2171-2dispatcher.h:259:5: error: no matching function for call to '_init_threading' Log
sflphone 1.1.0-2dispatcher.h:259:5: fatal error: no matching function for call to '_init_threading' Log
sigx 2.0.2-1src/connection_wrapper.cpp:174:5: error: no matching function for call to 'g_atomic_pointer_get' Log
tqsllib 2.2-5openssl_cert.cpp:1587:2: error: no matching function for call to 'ASN1_seq_pack' Log
7 errors
Return to the list