Debian Package rebuild

Rebuild of the Debian archive with clang

"No matching member or constructor call" build failure(s)
clang 3.2
Return to the list

Versions: 2.9 - 3.0 - 3.1 - 3.2 - 3.3 - 3.4 - 3.4.2 - 3.5.0 - 3.6.0 - 3.8.1
PackageVersionSupposed error messageFull log Bug report
gpsshogi 0.5.0-1dualThreatmateState.h:14:11: error: no matching constructor for initialization of 'volatile struct Flags' Log
libdecodeqr 0.9.3-6.2lsh_index.h:89:81: error: no matching constructor for initialization of 'cvflann::LshIndexParams' Log
liblip 2.0.0-1.1tnt_sparse_matrix_csr.h:97:3: error: no matching constructor for initialization of 'Array1D' Log
ncurses 5.9-10cursesf.h:684:7: error: no matching constructor for initialization of 'NCursesForm' Log
opencv 2.3.1-11lsh_index.h:89:81: error: no matching constructor for initialization of 'cvflann::LshIndexParams' Log
openmsx 0.9.1-1src/utils/SerializeBuffer.hh:45:5: error: no matching member function for call to 'insertN' Log
sikuli 1.0~x~rc3.tesseract3-dfsg1-5lsh_index.h:89:81: error: no matching constructor for initialization of 'cvflann::LshIndexParams' Log
7 errors
Return to the list