Debian Package rebuild

Rebuild of the Debian archive with clang

"Argument unused caused failure" build failure(s)
clang 3.2
Return to the list
Unknown or unused arguments triggers errors with -Werror:
clang -Werror -ggdb3 foo.c

Versions: 2.9 - 3.0 - 3.1 - 3.2 - 3.3 - 3.4 - 3.4.2 - 3.5.0 - 3.6.0 - 3.8.1
PackageVersionSupposed error messageFull log Bug report
bin-prot 2.0.7-1clang: error: argument unused during compilation: '-fno-defer-pop' Log
chordii 4.3+repack-2clang: error: argument unused during compilation: '--param ssp-buffer-size=4' Log
cifs-utils 2:5.5-1clang: error: argument unused during compilation: '--param ssp-buffer-size=4' Log
couchdb 1.2.0-5clang: error: argument unused during compilation: '--param ssp-buffer-size=4' Log
cups-bjnp 1.2-1clang: error: argument unused during compilation: '--param ssp-buffer-size=4' Log
deb-gview 0.2.9clang: error: argument unused during compilation: '--param ssp-buffer-size=4' Log
doxymacs 1.8.0-6clang: error: argument unused during compilation: '-fexpensive-optimizations' Log
dumpet 2.1-4clang: error: argument unused during compilation: '--param ssp-buffer-size=4' Log
ekeyd 1.1.5-4clang: error: argument unused during compilation: '--param ssp-buffer-size=4' Log
fastx-toolkit 0.0.13.2-1clang: error: argument unused during compilation: '--param ssp-buffer-size=4' Log
golang 2:1.0.2-2clang: error: argument unused during compilation: '-fno-eliminate-unused-debug-types' Log
ipsec-tools 1:0.8.0-14clang: error: argument unused during compilation: '--param ssp-buffer-size=4' Log
jansson 2.4-1clang: error: argument unused during compilation: '--param ssp-buffer-size=4' Log
keyutils 1.5.5-4clang: error: argument unused during compilation: '--param ssp-buffer-size=4' Log
libcli 1.9.6-1clang: error: argument unused during compilation: '--param ssp-buffer-size=4' [-Werror,-Wunused-command-line-argument] Log
libexttextcat 3.2.0-2clang: error: argument unused during compilation: '--param ssp-buffer-size=4' Log
libgconf-bridge 0.1-2.2clang: error: argument unused during compilation: '--param ssp-buffer-size=4' Log
libgphoto2 2.4.14-2clang: error: argument unused during compilation: '--param ssp-buffer-size=4' Log
libosl 0.5.0-1clang: error: argument unused during compilation: '-funswitch-loops' Log
libxcb 1.8.1-2clang: error: argument unused during compilation: '--param ssp-buffer-size=4' Log
lio-utils 3.1+git2.fd0b34fd-1clang: error: argument unused during compilation: '-shared' Log
lowpan-tools 0.3-1clang: error: argument unused during compilation: '--param ssp-buffer-size=4' Log
lua-augeas 0.1.1-2clang: error: argument unused during compilation: '--param ssp-buffer-size=4' Log
lv2proc 0.4.0-4clang: error: argument unused during compilation: '--param ssp-buffer-size=4' Log
mach 0.9.1-3.1clang: error: argument unused during compilation: '--param ssp-buffer-size=4' Log
mailavenger 0.8.3rc1-1clang: error: argument unused during compilation: '--param ssp-buffer-size=4' Log
memcached 1.4.13-0.1clang: error: argument unused during compilation: '--param ssp-buffer-size=4' Log
mosh 1.2.3-1clang: error: argument unused during compilation: '--param ssp-buffer-size=1' Log
muffin 1.1.2-1clang: error: argument unused during compilation: '--param ssp-buffer-size=4' Log
network-manager-openconnect 0.9.4.0-8clang: error: argument unused during compilation: '--param ssp-buffer-size=4' Log
network-manager-strongswan 1.3.0-1clang: error: argument unused during compilation: '--param ssp-buffer-size=4' Log
obfsproxy 0.1.4-2clang: error: argument unused during compilation: '--param ssp-buffer-size=1' Log
openswan 1:2.6.38-1clang: error: argument unused during compilation: '--param ssp-buffer-size=4' Log
pidgin-sipe 1.13.3-1clang: error: argument unused during compilation: '--param ssp-buffer-size=4' Log
pimd 2.1.8-2clang: error: argument unused during compilation: '--param ssp-buffer-size=4' Log
qof 0.8.6-1clang: error: argument unused during compilation: '--param ssp-buffer-size=4' Log
radsecproxy 1.6.2-1clang: error: argument unused during compilation: '--param ssp-buffer-size=4' Log
sendip 2.5-5clang: error: argument unused during compilation: '--param ssp-buffer-size=4' Log 753846
tempest-for-eliza 1.0.5-1clang: error: argument unused during compilation: '--param ssp-buffer-size=4' Log
xneur 0.15.0-1.1clang: error: argument unused during compilation: '--param ssp-buffer-size=4' Log 751542
40 errors
Return to the list