Debian Package rebuild

Rebuild of the Debian archive with clang

"Expected declaration (#define missing?)" build failure(s)
clang 3.3
Return to the list

Versions: 2.9 - 3.0 - 3.1 - 3.2 - 3.3 - 3.4 - 3.4.2 - 3.5.0 - 3.6.0 - 3.8.1
PackageVersionSupposed error messageFull log Bug report
aide 0.15.1-8./conf_yacc.h:39:12: error: expected value in expression Log
autounit 0.20.1-4test.c:305:7: error: expected expression Log 755961
chasen 2.4.5-9print.c:186:16: error: expected parameter declarator Log
clam-networkeditor 1.4.0-3.1xtime.hxx:38:3: error: expected '}' Log
clearsilver 0.10.5-1.3neo_files.c:219:12: error: expected expression Log 755963
cython 0.19+git51-g3078752-2compiling (cpp) and running cpp_iterators ... cpp_iterators.cpp:2189:45: error: expected the class name after '~' to name a destructor Log
dc-qt 0.2.0.alpha-4.2dcpp/StringDefs.h:488:2: error: expected '}' Log
dcap 2.47.7-2./util.h:14:12: error: expected parameter declarator Log 755964
dietlibc 0.33~cvs20120325-4:2:23: error: expected '@' or '%' before type Log
distcc 3.1-6src/snprintf.h:30:5: error: expected parameter declarator Log
fribidi 0.19.5-2fribidi-char-sets-cap-rtl.c:109:6: error: expected expression Log
gosmore 0.0.0.20100711-2.1libgosm.cpp:147:53: error: expected ')' Log 756077
gtg-trace 0.2+dfsg-1C/paje_GTGBasic1_c.c:14:12: error: expected parameter declarator Log
heimdall-flash 1.4~rc1+dfsg-1source/Arguments.h:135:130: error: expected ')' Log
icinga 1.9.1-2./../include/snprintf.h:29:5: error: expected parameter declarator Log
julia 0.1.2+dfsg-3toplevel.c:411:5: error: expected parameter declarator Log
krb5-appl 1:1.0.1-4../k5-platform.h:108:5: error: expected parameter declarator Log
libqb 0.14.3-2check_ipc.c:624:2: error: expected expression Log
librg-blast-parser-perl 0.03-1blast-parser-driver.h:61:12: error: expected a class or namespace Log
librostlab-blast 1.0.1-2./rostlab/blast-parser-driver.h:61:12: error: expected a class or namespace Log
libspf2 1.2.10-1spf_compile.c:580:5: error: expected expression Log
mawk 1.3.3-17print.c:85:11: error: expected parameter declarator Log
moc 1:2.5.0~beta1+svn20130411-1numeric_traits.h:63:25: error: expected member name or ';' after declaration specifiers Log
mp3fs 0.31-28-g7b30a54-1transcode.c:252:38: error: expected ')' Log
mtools 4.0.18-1mainloop.c:89:15: error: expected ')' Log
mutrace 0.2.0-2libiberty.h:616:12: error: expected parameter declarator Log
openjdk-6 6b27-1.12.6-1callNative.S:27:21: error: expected '@' or '%' before type Log
openjdk-7 7u25-2.3.10-1callNative.S:27:21: error: expected '@' or '%' before type Log
pchar 1.5-1./pc.h:28:15: error: expected '}' Log
pdns 3.1-4./cachecleaner.hh:21:38: error: expected expression Log
pdns-recursor 3.3-3./cachecleaner.hh:21:38: error: expected expression Log
pion-net 4.0.7+dfsg-3.1PionScheduler.cpp:105:40: error: expected unqualified-id Log
player 3.0.2+dfsg-4playerclient.cc:171:34: error: expected unqualified-id Log
qsapecng 2.0.0-5parser.h:78:41: error: expected ')' Log
ruby-gnome2 1.1.3-2glib-enum-types.c:600:10: error: expected expression Log
sdpa 7.3.9+dfsg-1mexFprintf.c:32:5: error: expected parameter declarator Log
sentinella 0.9.1-2MainWindow.h:70:33: error: expected ';' at end of declaration list Log
supercollider 1:3.5.3~repack-3sndfile_backend_test.cpp:46:34: error: expected unqualified-id Log
swift-im 2.0~beta1+dev47-1Swiften/Base/sleep.cpp:15:31: error: expected unqualified-id Log
systemtap 2.2.1-1main.cxx:914:3: error: expected '@' or '%' before type Log
texmaker 3.4-1./texmaker.h:121:67: error: expected member name or ';' after declaration specifiers Log
urjtag 0.10+r2007-1../../include/libiberty.h:589:12: error: expected parameter declarator Log
visualboyadvance 1.8.0.dfsg-2debugger.cpp:1725:36: error: expected ')' Log
43 errors
Return to the list