Debian Package rebuild

Rebuild of the Debian archive with clang

"OpenMP is not yet available in Clang" build failure(s)
clang 3.3
Return to the list

Versions: 2.9 - 3.0 - 3.1 - 3.2 - 3.3 - 3.4 - 3.4.2 - 3.5.0 - 3.6.0 - 3.8.1
PackageVersionSupposed error messageFull log Bug report
3depict 0.0.13-1base.h:37:10: fatal error: 'omp.h' file not found Log
aaphoto 0.41-1.1aaphoto.c:235:10: fatal error: 'omp.h' file not found Log
caret 5.6.4~dfsg.1-3BrainModelVolumeROISmoothing.cxx:29:10: fatal error: 'omp.h' file not found Log
ccbuild 2.0.4-1src/system/system.ih:44:10: fatal error: 'omp.h' file not found Log
cd-hit 4.6-2012-04-25-1cdhit-common.c++:36:9: fatal error: 'omp.h' file not found Log
clustalo 1.2.0-1ktuple_pair.c:41:10: fatal error: 'omp.h' file not found Log
coinor-csdp 6.1.1-1op_o.c:15:10: fatal error: 'omp.h' file not found Log
dds 2.1.2+ddd105-1./dll.h:26:14: fatal error: 'omp.h' file not found Log
fasttree 2.1.7-1fasttree.c:303:10: fatal error: 'omp.h' file not found Log
fflas-ffpack 1.6.0-1../utils/timer.h:162:10: fatal error: 'omp.h' file not found Log
gabedit 2.4.6-2Grid.c:23:10: fatal error: 'omp.h' file not found Log
gfal2 2.2.1-2gfal_common_srm_copy.c:24:10: fatal error: 'omp.h' file not found Log
gpivtools 0.6.0-3configure: error: "missing omp.h" Log
libgpiv 0.6.1-4configure: error: "missing omp.h" Log
libm4ri 20130416-3m4ri/strassen.c:35:10: fatal error: 'omp.h' file not found Log
mldemos 0.5.1-1PSO/optimizer.h:40:10: fatal error: 'omp.h' file not found Log
molds 0.2.0-1base/Utilities.cpp:26:9: fatal error: 'omp.h' file not found Log
monav 0.3-6mapnikrenderer.cpp:33:10: fatal error: 'omp.h' file not found Log
octave-nurbs 1.3.6-1bspeval.cc:19:10: fatal error: 'omp.h' file not found Log
plastimatch 1.5.11+dfsg0-1bspline_interpolate.cxx:11:10: fatal error: 'omp.h' file not found Log
pyfai 0.3.5-1src/histogram.c:251:10: fatal error: 'omp.h' file not found Log
scilab 5.4.1-3configure: error: Could not find omp.h Log
shelxle 1.0.634-1fourxle.cpp:650:10: fatal error: 'omp.h' file not found Log
tenace 0.12-1dds.h:26:14: fatal error: 'omp.h' file not found Log
24 errors
Return to the list