Debian Package rebuild

Rebuild of the Debian archive with clang

"Changes of default constructor" build failure(s)
clang 3.4
Return to the list
This code is a defect of the C++ standard:
http://www.open-std.org/jtc1/sc22/wg21/docs/cwg_active.html#1344
class foo {
    int a;
    foo(int);
};

foo::foo(int c = 5) : a(c) {

}


Versions: 2.9 - 3.0 - 3.1 - 3.2 - 3.3 - 3.4 - 3.4.2 - 3.5.0 - 3.6.0 - 3.8.1
PackageVersionSupposed error messageFull log Bug report
bzflag 2.4.2+ds1-5../../include/VotingArbiter.h:234:56: error: addition of default argument on redeclaration makes this constructor a default constructor Log 753262
desmume 0.9.9-1filter/videofilter.cpp:45:39: error: addition of default argument on redeclaration makes this constructor a default constructor Log
eiskaltdcpp 2.2.9-2HubFrame.cpp:775:29: error: addition of default argument on redeclaration makes this constructor a default constructor Log 753266
gpsim 0.27.0-1switch.cc:585:30: error: addition of default argument on redeclaration makes this constructor a default constructor Log 753268
gtkguitune 0.8-6lcdview.cc:26:31: error: addition of default argument on redeclaration makes this constructor a default constructor Log
kbibtex 0.4-4websearchabstract.cpp:69:63: error: addition of default argument on redeclaration makes this constructor a default constructor Log 753270
linpsk 1.1-1.1../../src/csound.cpp:23:22: error: addition of default argument on redeclaration makes this constructor a default constructor Log 753272
mumble 1.2.4-0.1VoiceRecorderDialog.cpp:41:51: fatal error: addition of default argument on redeclaration makes this constructor a default constructor Log 753273
polygraph 4.3.2-1.1PglIntSym.cc:27:20: error: addition of default argument on redeclaration makes this constructor a default constructor Log 753274
scribus 1.4.2.dfsg+r18267-1.1runscriptdialog.cpp:13:43: error: addition of default argument on redeclaration makes this constructor a default constructor Log 753277
ucimf-openvanilla 2.10.11-2openvanilla.cpp:32:33: error: addition of default argument on redeclaration makes this constructor a default constructor Log 753337
wicd-kde 0.3.0-2networkplotter.cpp:28:47: error: addition of default argument on redeclaration makes this constructor a default constructor Log 753339
zaz 1.0.0~dfsg1-2mixer.cpp:26:24: error: addition of default argument on redeclaration makes this constructor a default constructor Log 753340
13 errors
Return to the list