Debian Package rebuild

Rebuild of the Debian archive with clang

"Expected declaration (#define missing?)" build failure(s)
clang 3.4
Return to the list

Versions: 2.9 - 3.0 - 3.1 - 3.2 - 3.3 - 3.4 - 3.4.2 - 3.5.0 - 3.6.0 - 3.8.1 - 3.9.1 - 4.0.1 - 5.0
PackageVersionSupposed error messageFull log Bug report
ats-lang-anairiats 0.2.11-1bool.cats:42:5: error: expected parameter declarator Log
autounit 0.20.1-4test.c:305:7: error: expected expression Log 755961
chasen 2.4.5-9print.c:186:16: error: expected parameter declarator Log
clearsilver 0.10.5-1.3neo_files.c:219:12: error: expected expression Log 755963
cython 0.19.2+git5-g0c6fdf0-1compiling (cpp) and running cpp_iterators ... cpp_iterators.cpp:2194:45: error: expected the class name after '~' to name a destructor Log
dc-qt 0.2.0.alpha-4.2dcpp/StringDefs.h:488:2: error: expected '}' Log
dcap 2.47.8-2./util.h:14:12: error: expected parameter declarator Log 755964
distcc 3.1-6src/snprintf.h:30:5: error: expected parameter declarator Log
fakechroot 2.17.2-1./libfakechroot.h:211:5: error: expected parameter declarator Log
fribidi 0.19.6-1fribidi-char-sets-cap-rtl.c:109:6: error: expected expression Log
gosmore 0.0.0.20100711-2.1libgosm.cpp:147:53: error: expected ')' Log 756077
gr-iqbal 0.37.1.5.d4fd4d-1cxvec.h:45:15: error: expected ';' at end of declaration list Log
gtg-trace 0.2+dfsg-1C/paje_GTGBasic1_c.c:14:12: error: expected parameter declarator Log
icinga 1.10.2-1./../include/snprintf.h:29:5: error: expected parameter declarator Log
krb5-appl 1:1.0.1-4../k5-platform.h:108:5: error: expected parameter declarator Log
libiberty 20131116-1../libiberty/../include/libiberty.h:616:12: error: expected parameter declarator Log
librg-blast-parser-perl 0.03-1blast-parser-driver.h:61:12: error: expected a class or namespace Log
librostlab-blast 1.0.1-2./rostlab/blast-parser-driver.h:61:12: error: expected a class or namespace Log
libspf2 1.2.10-2spf_compile.c:580:5: error: expected expression Log
mawk 1.3.3-17print.c:85:11: error: expected parameter declarator Log
moc 1:2.5.0~beta1+svn20131120-1numeric_traits.h:63:25: error: expected member name or ';' after declaration specifiers Log
mtools 4.0.18-1mainloop.c:89:15: error: expected ')' Log
netpipe 3.7.2-7mpi.h:116:56: error: expected identifier Log
pchar 1.5-2./pc.h:28:15: error: expected '}' Log
sdpa 7.3.9+dfsg-1mexFprintf.c:32:5: error: expected parameter declarator Log
sentinella 0.9.2-3MainWindow.h:108:21: error: expected ';' at end of declaration list Log
tcos 0.89.93mount_listener.c:43:5: error: expected parameter declarator Log
visualboyadvance 1.8.0.dfsg-2debugger.cpp:1725:36: error: expected ')' Log
28 errors
Return to the list