Debian Package rebuild

Rebuild of the Debian archive with clang

"Not categorized" build failure(s)
clang 3.4
Return to the list

Versions: 2.9 - 3.0 - 3.1 - 3.2 - 3.3 - 3.4 - 3.4.2 - 3.5.0 - 3.6.0 - 3.8.1 - 3.9.1 - 4.0.1 - 5.0
PackageVersionSupposed error messageFull log Bug report
389-dsgw 1.1.9-1../doauth.c:30:5: error: third parameter of 'main' (environment) must be of type 'char **' Log
9base 1:6-6n1.c:124:5: error: unterminated function-like macro invocation Log
aconnectgui 0.9.0rc2-1-9configure: error: Sufficiently new version of libasound not found. Log 684508
acpid 1:2.0.20-1configure: error: "asprintf() not found" Log
activiz.net 1:1.0~git20111214-2stddef.h:29:42: error: missing binary operator before token "(" Log
adacgi 1.6-17Undetected errorLog
aegis 4.24.3-3Undetected errorLog
aeskulap 0.2.2b1-12./poolinstance.h:53:25: error: no function named 'remove_instance' with type 'void (const Glib::RefPtr &)' was found in the specified scope Log
agave 0.4.7-2.1refptr.h:208:16: error: member access into incomplete type 'gcs::PaletteTreeModel' Log
apbs 1.4-1Undetected errorLog
aplus-fsf 4.22.1-6../MSTypes/MSFloatMatrix.H:30:1: error: template specialization requires 'template<>' Log
apq-postgresql 3.2.0-2Undetected errorLog
aptitude 0.6.8.2-1.2configure: error: in `/«PKGBUILDDIR»/build-arch' Log
aqemu 0.8.2-2VM.cpp:4566:75: error: reference to type 'const QString' could not bind to an rvalue of type 'bool' Log
arj 3.10.22-11Undetected errorLog
aspectc++ 1:1.2-1stddef.h:29: error: unexpected token `(' in conditional Log
atlas 3.10.1-2Undetected errorLog
atlas-cpp 0.6.2-4Undetected errorLog
avifile 1:0.7.48~20090503.ds-14common/avm_output.cpp:20:12: error: qualified reference to 'AvmOutput' is a constructor name rather than a type wherever a constructor can be declared Log
avw.lv2 0.1.6~dfsg0-1ui_features.hpp:47:45: error: assigning to 'mapped_type' (aka 'void (*)(void *, void *)') from incompatible type 'void (*)(void *, FeatureData *)': type mismatch at 2nd parameter ('void *' vs 'FeatureData *' (aka 'void **')) Log
ax25-tools 0.0.10-rc2+cvs20120204-3./rip98d.h:47:12: error: restrict requires a pointer or reference Log
beast 0.7.4-5configure: error: "failed to detect POLLIN" Log
blas 1.2.20110419-7Undetected errorLog
blktap 2.0.90-2libvhd.c:1073:2: error: indirection of non-volatile null pointer will be deleted, not trap [-Werror,-Wnull-dereference] Log
blobby 1.0~rc3-3RakPeer.cpp:1063:3: error: cannot delete expression of type 'char [16]' Log
boinc 7.2.33+dfsg-1configure: error: in `/«BUILDDIR»/boinc-7.2.33+dfsg' Log
boinc-app-seti 7.19~svn2050-2.is.7.00~svn1933-2../../client/vector/x86_ops.h:141:42: error: type of machine mode does not match type of base type Log
bomberclone 0.11.9-4../include/gfx.h:108:20: error: inline function 'gfx_blitupdaterectclear' is not defined [-Werror,-Wundefined-inline] Log
busybox 1:1.21.0-1findutils/find.c:911:2: error: illegal storage class on function Log
canl-c++ 1.0.1-1make[2]: *** No rule to make target `', needed by `canl_wrap.cpp'. Stop. Log
cernlib 20061220+dfsg3-4Undetected errorLog
cgal 4.2-5Undetected errorLog
cinnamon 1.7.4-2.2st/st-background-effect.c:240:28: error: invalid suffix 'd' on floating constant Log
clsync 0.2.1-1configure: error: "Unable to find dlfcn.h" Log
coinor-flopc++ 1.0.6-3.1./MP_domain.hpp:180:18: error: return type of virtual function 'getSet' is not covariant with the return type of the function it overrides ('flopc::MP_set_base' is incomplete) Log
condor 7.8.8~dfsg.1-2.1HashTable.h:264:23: error: invalid operands to binary expression ('ThreadInfo' and 'const ThreadInfo') Log
cone 0.89-1cursesmessage.C:3764:18: error: cannot create a non-constant pointer to member function Log
cook 2.33-1Undetected errorLog
csound 1:6.01~dfsg-2Undetected errorLog
ctpp2 2.8.3-7Undetected errorLog
cupt 2.6.4dependencygraph.cpp:627:21: error: chosen constructor is explicit in copy-initialization Log
dacs 1.4.28b-3Undetected errorLog
dehydra 0.9.hg20120525-1Undetected errorLog
dicom3tools 1.00~20131005-1./Imakefile:163:3: error: invalid preprocessing directive Log
din 5.2.1-2main.cc:296:49: error: non-aggregate type 'const color' cannot be initialized with an initializer list Log
dmapi 2.2.10-1Undetected errorLog
ekg2 1:0.4~pre+20120506.1-3Makefile.am:144: error: 'plugins/autoresponder/autoresponder.la' is not a standard libtool library name Log
enigmail 2:1.6-4mozalloc.h:197:21: error: replacement function 'operator new' cannot be declared 'inline' [-Werror,-Winline-new-delete] Log
estic 1.61-20.1./coll.h:317:7: error: invalid operands to binary expression ('Stream' and 'u32' (aka 'unsigned int')) Log
esys-particle 2.2.u2-2./SphAggGougeBlock.hpp:39:37: error: no viable conversion from '__normal_iterator' to '__normal_iterator' Log
fftw3 3.3.3-7openmp.c:26:2: error: OpenMP enabled but not using an OpenMP compiler Log
fox1.6 1.6.49-1Dependencies installation failed Log
freefem3d 1.0pre10-3.1libtool.m4: error: problem compiling CXX test program Log
freefoam 0.1.0+dfsg-1Pstream.H:518:29: error: no function named 'reduce' with type 'void (scalar &, const sumOp &)' was found in the specified scope Log
freetype 2.5.2-1./builds/unix/ftconfig.h:532:5: error: 'long long' is an extension when C99 mode is not enabled [-Werror,-Wlong-long] Log
fsvs 1.2.5-1configure: error: in `/«PKGBUILDDIR»' Log
fvwm 1:2.6.5.ds-3configure: error: " Log
gbsplay 0.0.91-1Undetected errorLog
gcc-msp430 4.6.3~mspgcc-20120406-5Undetected errorLog
gdal 1.10.1+dfsg-2gdal_wrap.cpp:4494:12: error: assigning to 'char *' from incompatible type 'const char *' Log
gdb-mingw-w64 7Undetected errorLog
gdcm 2.2.4-1.1stddef.h:29:42: error: missing binary operator before token "(" Log
geant321 1:3.21.14.dfsg-11Undetected errorLog
geda-gaf 1:1.8.2-2dh_auto_test: make -j1 check returned exit code 2 Log
genius 1.0.14-1configure: error: Termcap library not found Log
ghc 7.6.3-6configure: error: Building ghc-pwd failed Log
giftrans 1.12.2-17Undetected errorLog
glibmm2.4 2.36.2-1Undetected errorLog
gmerlin 1.2.0~dfsg+1-1bgyadif.c:769:9: error: ambiguous instructions require an explicit suffix (could be 'cmpb', 'cmpw', 'cmpl', or 'cmpq') Log
gnash 0.8.11~git20130903-3agg_scanline_u.h:476:30: error: type 'base_type' (aka 'agg::scanline_u8') is not a direct or virtual base of 'scanline32_u8_am' Log
gnucap 1:0.36~20091207-2./mg_.h:134:19: error: variable has incomplete type 'C_Comment' Log
gnustep-gui 0.20.0-3GSSpeechSynthesizer.m:118:21: error: direct access to Objective-C's isa is deprecated in favor of object_getClass() [-Werror,-Wdeprecated-objc-isa-usage] Log
gnutls28 3.2.8.1-2dh_auto_test: make -j10 check returned exit code 2 Log
golang 2:1.2-2Undetected errorLog
google-glog 0.3.3-1Undetected errorLog
gprolog 1.3.0-6.1Undetected errorLog
gringo 4.2.1-3Undetected errorLog
grub 0.97-67configure: error: x86_64-linux-gnu-gcc cannot compile C source code Log
grub2 2.00-22configure: error: gcc-4.7 failed to produce assembly code Log
guile-2.0 2.0.9+1-1Undetected errorLog
hardening-wrapper 2.5dh_auto_test: make -j1 check returned exit code 2 Log
haskell-hledger-web 0.22-1Undetected errorLog
haskell-hopenpgp-tools 0.0.4-1Dependencies installation failed Log
hivex 1.3.8-1../../../ocaml/hivex_c.c:52:1: error: static declaration of 'caml_raise_with_args' follows non-static declaration Log
hugs98 98.200609.21-5.3tools/make_bootlib: 68: tools/make_bootlib: -D__HUGS__: not found Log
hwinfo 16.0-2.2./AsmMacros.h:366:24: error: invalid operand in inline asm: 'in${0:B} ($1)' Log
hylafax 3:6.0.6-5Undetected errorLog
hyperestraier 1.4.13-11Undetected errorLog
ibus-qt 1.3.1-4qibusserializable.h:94:59: error: non-const lvalue reference to type 'QVariant' cannot bind to a temporary of type 'QVariant' Log
icecc 1.0.1-1dh_install: missing files, aborting Log
iceweasel 24.2.0esr-1clang: error: unable to execute command: Broken pipe Log
icewm 1.3.7-5../../src/apppstatus.cc:85:5: error: cannot delete expression of type 'YColor *[3]' Log
idjc 0.8.9-1configure: error: "math library is missing critical function" Log
imvirt 0.9.6-1vmware.c:65:5: error: invalid operand for instruction Log
ipsec-tools 1:0.8.0-14.1isakmp.c:1137:11: error: promoted type 'int' of K&R function parameter is not compatible with the parameter type 'u_int8_t' (aka 'unsigned char') declared in a previous prototype [-Werror,-Wknr-promoted-parameter] Log
jscoverage 0.5.1-2configure: error: No size found for void* Log
kannel 1.4.3-2test/test_octstr_format.c:66:28: error: integer constant is larger than the largest unsigned integer type Log
kplayer 1:0.7-2.1kplayernode.cpp:2401:5: error: unexpected ':' in nested name specifier; did you mean '::'? Log
laserboy 2012.11.11-1LaserBoy_frame_set.hpp:259:38: error: parameter of overloaded 'operator++' cannot have a default argument Log
lcgdm 1.8.7-2Undetected errorLog
lensfun 0.2.8-1lensfun.h:68:13: error: "I don't know how to change symbol visibility for your compiler" Log
libapache2-mod-perl2 2.0.8+httpd24-r1449661-6dh_auto_test: make -j1 test returned exit code 2 Log
libb-hooks-parser-perl 0.12-1dh_auto_test: make -j1 test returned exit code 2 Log
libcrypto++ 5.6.1-6gcm.cpp:746:3: error: unknown token in expression Log
libdvbpsi 1.0.0-3descriptors/dr_7c.c:248:76: error: operator '?:' has lower precedence than '-'; '-' will be evaluated first [-Werror,-Wparentheses] Log
libgisi 0.1.0-1gisicomm.c:1848:8: error: duplicate case value: 'MTC_STATE_NONE' and 'MTC_CMT_ONLY_MODE' both equal '255' Log
libgweather 3.8.2-3gweather-location.c:919:57: error: invalid suffix 'd' on floating constant Log
libindi 0.9.7-1mathcalls.h:310:14: error: exception specification in declaration does not match previous declaration Log
libncursesada 5.9.20110404-7configure: error: No usable Ada compiler found Log
liboil 0.3.17-2wavelet.c:1759:27: error: invalid use of a cast in a inline asm context requiring an l-value: remove the cast or build with -fheinous-gnu-extensions Log
libomxalsa 0.1-2configure: error: POSIX threads support is required Log
libomxcamera 0.1-2configure: error: in `/«PKGBUILDDIR»' Log
libomxfbdevsink 0.1-2configure: error: in `/«PKGBUILDDIR»' Log
libomxil-bellagio 0.9.3-1configure: error: libdl is required Log
libomxmad 0.1-1configure: error: POSIX threads support is required Log
libomxvideosrc 0.1-1configure: error: in `/«PKGBUILDDIR»' Log
libomxvorbis 0.1-3configure: error: in `/«PKGBUILDDIR»' Log
libomxxvideo 0.1-2configure: error: POSIX threads support is required Log
libopendbx 1.4.6-4Undetected errorLog
libraw 0.15.4-1Undetected errorLog
libs3 2.0-2inc/request.h:131:14: error: sizeof on pointer operation will return size of 'char *' instead of 'char [9]' [-Werror,-Wsizeof-array-decay] Log
libv8-3.14 3.14.5.8-5../src/../include/v8.h:2990:5: error: anonymous types declared in an anonymous union are an extension [-Werror,-Wnested-anon-types] Log
libvirt 1.2.0-2dh_auto_test: make -j1 check returned exit code 2 Log
libwx-perl 1:0.9922-2Undetected errorLog
libwx-scintilla-perl 0.38-1Undetected errorLog
libxc 2.0.2-1Undetected errorLog
licenseutils 0.0.7-1dh_auto_test: make -j1 check returned exit code 2 Log
lierolibre 0.5-1src/gvl/io/encoding.hpp:586:19: error: cast from pointer to smaller type 'uint32_t' (aka 'unsigned int') loses information Log
lightspark 0.7.2-3Undetected errorLog
lilypond 2.16.2-3arpeggio-engraver.cc:102:1: error: cannot cast from type 'void (Arpeggio_engraver::*)(Grob_info)' to pointer type 'Engraver_void_function_engraver_grob_info' (aka 'void (*)(Engraver *, Grob_info)') Log
linux 3.12.6-2Undetected errorLog
linux-latest 55Undetected errorLog
linux-tools 3.12.6-1Undetected errorLog
lookup 1.08b-11lib/romaji2kana.c:59:12: error: source file is not valid UTF-8 Log
lordsawar 0.2.0-2.1armyproto.cpp:39:34: error: array initializer must be an initializer list Log
lvtk 1.1.1~dfsg0-1ui_features.hpp:47:45: error: assigning to 'mapped_type' (aka 'void (*)(void *, void *)') from incompatible type 'void (*)(void *, FeatureData *)': type mismatch at 2nd parameter ('void *' vs 'FeatureData *' (aka 'void **')) Log
lwt 2.4.3-4Undetected errorLog
m4 1.4.17-2dh_auto_test: make -j1 check returned exit code 2 Log
mailutils 1:2.99.98-1.1Undetected errorLog
mclibs 20061220+dfsg3-3Undetected errorLog
megaglest 3.7.1-2Undetected errorLog
memcached 1.4.13-0.3testapp.c:1784:13: error: variable length array folded to constant array as an extension [-Werror,-Wgnu-folding-constant] Log
memtest86 4.3.6-1main.c:229:2: error: indirect goto in function with no address-of-label expressions Log
memtest86+ 4.20-1.1main.c:118:2: error: indirect goto in function with no address-of-label expressions Log
mingw32-binutils 2.20-0.2Undetected errorLog
mknbi 1.4.4-10Undetected errorLog
mldemos 0.5.1-3./SECovarianceFunction.h:23:13: error: field has incomplete type 'float []' Log
modemmanager 0.5.2.0-2.1commands.c:1192:16: error: expression which evaluates to zero treated as a null pointer constant of type 'QcdmResult *' (aka 'struct QcdmResult *') [-Werror,-Wnon-literal-null-conversion] Log
molds 0.3.0-3base/MolDSException.cpp:164:7: error: invalid operands to binary expression ('boost::archive::text_oarchive' and 'MolDS_base::MolDSException *') Log
mongodb 1:2.4.8-2Undetected errorLog
mosquitto 1.2.1-109-util-topic-tokenise.c:8:21: error: data argument not used by format string [-Werror,-Wformat-extra-args] Log
mozjs17 17.0.0-1jsinterp.cpp:3684:9: error: indirect goto might cross protected scopes Log
mpich2 1.4.1-4.2configure: error: Cannot build shared libraries with this compiler Log
mrpt 1:1.0.2-1math_frwds.h:161:157: error: calling 'lightFromPose' with incomplete return type 'mrpt::math::TPoint2D' Log
mrs 6.0.4+dfsg-1Undetected errorLog
mwrap 0.33-1dh_auto_test: make -j1 test returned exit code 2 Log
mysql-workbench 6.0.8+dfsg-2my_sys.h:277:27: error: definition of variable with array type needs an explicit size or an initializer Log
nast 0.2.0-6Undetected errorLog
ncmpcpp 0.5.10-1.1./screen.h:265:3: error: cannot initialize object parameter of type 'NCurses::Window' with an expression of type 'NCurses::Scrollpad' Log
netsurf 2.9-2Undetected errorLog
nget 0.27.1-11./par2/par2fileformat.h:89:25: error: flexible array member 'entries' of non-POD element type 'FILEVERIFICATIONENTRY []' Log
nn 6.7.3-8make[2]: *** No rule to make target ` articles.h', needed by `nn.o'. Stop. Log
nodejs 0.10.24~dfsg1-1Undetected errorLog
npapi-vlc 2.0.6-2./control/nporuntime.h:225:13: error: static declaration of 'RuntimeNPClassGetProperty' follows non-static declaration Log
ns2 2.35+dfsg-1common/tclAppInit.cc:240:26: error: declaration of 'globalMemTrace' has a different language linkage Log
nss 2:3.15.3.1-1Dependencies installation failed Log
oasis 0.3.0-4Undetected errorLog
obby 0.4.8-1../inc/zeroconf_avahi.hpp:135:40: error: assigning to 'AvahiWatchEvent' from incompatible type 'int' Log
obexftp 0.23-1.2bfb_io.c:415:44: error: hex escape sequence out of range Log
ocaml-text 0.6-3Undetected errorLog
oce 0.12-4dh_auto_test: make -j10 test ARGS+=-j10 returned exit code 2 Log
ocl-icd 2.1.3-2./ocl_icd.h:33:34: error: unknown warning group '-Wcpp', ignored [-Werror,-Wunknown-pragmas] Log
octave 3.6.4-4../liboctave/eigs-base.cc:3837:1: error: explicit instantiation cannot have a storage class Log
open-cobol 1.1-1dh_auto_test: make -j1 check returned exit code 2 Log
opencity 0.0.6.4stable-1.1../../src/destination.h:25:6: error: redeclaration of already-defined enum 'OPENCITY_DIRECTION' is a GNU extension [-Werror,-Wgnu-redeclared-enum] Log
openhpi 2.14.1-1.3ipmi.cpp:1563:83: error: alias must point to a defined variable or function Log
openjdk-6 6b29-1.13.0-2callNative.S:27:21: error: unsupported attribute in '.type' directive Log
openjdk-7 7u45-2.4.3-4callNative.S:27:21: error: unsupported attribute in '.type' directive Log
openmprtl 0.20130912-1Undetected errorLog
openmsx-catapult 0.9.1-1Undetected errorLog
otcl 1.14+dfsg-2tclInt.h:54:13: error: typedef redefinition with different types ('int' vs 'long') Log
paw 1:2.14.04.dfsg.2-9Undetected errorLog
pcp 3.8.9access.o: r .L.str : Error: additional symbol Log
pdftk 2.01-1javaprims.h:40:8: error: unknown linkage language Log
pennmush 1.8.2p8-1.1atr_tab.c:217:19: error: operand of type 'void' where arithmetic or pointer type is required Log
pingus 0.7.6-1.1src/lisp/getters.hpp:33:15: error: no viable conversion from 'std::shared_ptr' to 'const lisp::Lisp *' Log
plastimatch 1.5.15+dfsg-1dh_auto_test: make -j10 test ARGS+=-j10 returned exit code 2 Log
polybori 0.8.3-3Undetected errorLog
popplerkit.framework 0.0.20051227svn-7.1ld: warning: cannot find entry symbol _start; defaulting to 00000000004001c0 Log
postgresql-9.1 9.1.11-2configure: error: thread test program failed Log
postgresql-9.3 9.3.2-1configure: error: thread test program failed Log
prime-phylo 1.0.11-1PrimeOptionMap.hh:161:32: error: no function named 'operator<<' with type 'std::ostream &(std::ostream &, const beep::PrimeOptionMap &)' was found in the specified scope Log
pycurl 7.19.0-7Dependencies installation failed Log
python-cffi 0.7.2-2dh_auto_test: pybuild --test -i python{version}-dbg -p 2.7 --dir . returned exit code 13 Log
python3.3 3.3.3-5debian/patches/series.in:39:2: error: invalid preprocessing directive Log
python3.4 3.4~b1-5debian/patches/series.in:18:2: error: invalid preprocessing directive Log
pyxine 0.1alpha2-8pyxine/libxine_wrap.c:3141:2: error: invalid preprocessing directive Log
rampart 1.3.0-3error.c:91:5: error: implicitly declaring library function 'vsnprintf' with type 'int (char *, unsigned long, const char *, __va_list_tag *)' [-Werror] Log
rawtherapee 4.0.11+dfsg-1stdimagesource.cc:30:1: error: static data member definition cannot specify a storage class Log
reprepro 4.13.1-1sourceextraction.c:132:2: error: illegal storage class on function Log
rheolef 6.5-1:1352:2: error: 'register' storage class specifier is deprecated [-Werror,-Wdeprecated-register] Log
roboptim-core 2.0-5twice-differentiable-function.hh:69:5: error: class member cannot be redeclared [-Werror,-Wredeclared-class-member] Log
rtmidi 2.0.1~ds0-3RtMidi.cpp:3412:15: error: 'long long type-name' is invalid Log
sam2p 0.49.2-2configure: error: cannot compute depends Log
sbnc 1.2-26./../Object.h:163:14: error: 'CUser' is an incomplete type Log
scantailor 0.9.11.1-1MatrixCalc.h:127:10: error: calling a private constructor of class 'mcalc::Mat' Log
scheme48 1.9-3Undetected errorLog
schroot 1.6.7-1Dependencies installation failed Log
sinfo 0.0.47-1bind.hpp:69:22: error: type 'void (*)(int) __attribute__((noreturn))' cannot be used prior to '::' because it has no members Log
sks-ecc 0.93-3tfm/mpi.c:2565:15: error: unknown register name '%cc' in asm Log
snapper 0.1.8-1stl_list.h:114:33: error: call to implicitly-deleted copy constructor of 'Client' Log
snappy 1.1.0-1Undetected errorLog
socat 1.7.2.2-1./xio.h:356:4: error: "unexpected size of off_t, please report this as bug" Log
soprano 2.9.4+dfsg-1Undetected errorLog
sra-sdk 2.3.4-2+dfsg-1Undetected errorLog
starpu 1.1.0+dfsg-2dh_install: libstarpu-dev missing files (usr/lib/starpu/*/gcc/*/*.so*), aborting Log
styx 2.0.1-1sysbase1.c:579:50: error: invalid token at start of a preprocessor expression Log
subtle 0.11.3224-xi-1src/subtle/panel.c:265:41: error: initializer overrides prior initialization of this subobject [-Werror,-Winitializer-overrides] Log
supercollider 1:3.6.3~repack-5Undetected errorLog
suricata 1.4.7-1configure: error: pcre.h not found ... Log
tbb 4.2~20130725-1.1../../src/tbb/tools_api/ittnotify_config.h:267:33: error: unsupported inline asm: input with type 'long' matching output with type 'int' Log
tcc 0.9.26~git20120612.ad5f375-6libtcc1.c:673:45: error: too few arguments provided to function-like macro invocation Log
tclex 1.2a1-16tclInt.h:54:13: error: typedef redefinition with different types ('int' vs 'long') Log
tdb 1.2.12-1Undetected errorLog
tpb 0.6.4-8Undetected errorLog
traverso 0.49.2-6Tsar.h:66:9: error: field has incomplete type 'void *[]' Log
triggerhappy 0.3.4-2make[1]: *** No rule to make target `evtable_EV.h', needed by `eventnames.o'. Stop. Log
troffcvt 1.04-21Undetected errorLog
tudu 0.8.2-1Undetected errorLog
ufraw 0.19.2-2ufraw_settings.cc:54:12: error: declaration of 'ufRawImage' with C language linkage conflicts with declaration in global scope Log
uwsgi 1.9.17.1-5NSObject.h:405:1: error: method has no return type specified; defaults to 'id' [-Werror,-Wmissing-method-return-type] Log
vboot-utils 0~20121212-3Undetected errorLog
vdr-plugin-xineliboutput 1.1.0-1make[2]: *** No rule to make target `dbus/dbus-glib.h', needed by `tools/gnome_screensaver.o'. Stop. Log
visp 2.8.0-3dh_auto_test: make -j1 test ARGS+=-j1 returned exit code 2 Log
wesnoth-1.10 1:1.10.7-1Undetected errorLog
wesnoth-1.11 1:1.11.7-1Undetected errorLog
whois 5.1.0Undetected errorLog
wvstreams 4.6.1-7configure: error: in `/«PKGBUILDDIR»' Log
xbmc 2:12.3+dfsg1-3cpluff.c:80:35: error: too many arguments provided to function-like macro invocation Log
xcftools 1.0.7-4Undetected errorLog
xdb 1.2.0-7.2dh_install: libxdb1 missing files (debian/tmp/usr/lib/*.so.*), aborting Log
xen 4.3.0-3Undetected errorLog
xhprof 0.9.4-1configure: error: in `/«PKGBUILDDIR»/extension' Log
xine-lib 1.1.21-1.2mmx.c:126:3: error: clobbers must be last on the x87 stack Log
xine-lib-1.2 1.2.4-2mmx.c:126:3: error: clobbers must be last on the x87 stack Log
xmpi 2.2.3b8-13.1configure: error: cannot continue -- cannot find Trillium header files Log
xorp 1.8.5-2Undetected errorLog
xsd 3.3.0.1-1.4static-ptr.hxx:63:28: error: cannot allocate function type 'Cult::MM::KeyList ()' with new Log
xtrlock 2.3Dependencies installation failed Log
yafaray 0.1.5-3mathOptimizations.h:125:3: error: ambiguous instructions require an explicit suffix (could be 'flds', 'fldl', or 'fldt') Log
yap 6.2.2-2configure: error: in `/«PKGBUILDDIR»/arch' Log
z80ex 1.1.21-1dh_install: libz80ex-dev missing files (usr/lib/lib*.a), aborting Log
zeitgeist 0.9.14-2controller.cpp:131:19: error: cannot cast from type 'gboolean (ZeitgeistFTS::Controller::*)()' to pointer type 'GSourceFunc' (aka 'gboolean (*)(gpointer)') Log
zeroc-ice 3.5.1-5lex.yy.c:805:2: error: 'register' storage class specifier is deprecated [-Werror,-Wdeprecated-register] Log
zzuf 0.13.svn20100215-4Undetected errorLog
255 errors
Return to the list