Debian Package rebuild

Rebuild of the Debian archive with clang

"Unknown argument" build failure(s)
clang 3.4.2
Return to the list
gcc has plenty of options. Some of them should be implemented by clang, some other, no.
A first discussion occurred on this subject on the clang mailing list.
Versions: 2.9 - 3.0 - 3.1 - 3.2 - 3.3 - 3.4 - 3.4.2 - 3.5.0 - 3.6.0 - 3.8.1
PackageVersionSupposed error messageFull log Bug report
advi 1.10.2-2clang: error: unknown argument: '-fno-defer-pop' Log
asis 2013-1clang: error: unknown argument: '-gnatea' Log
batmand 0.3.2-14clang: error: unknown argument: '-fuse-linker-plugin' Log
bin-prot 109.30.00-2clang: error: unknown argument: '-fno-defer-pop' Log
bluez 4.101-4.1clang: error: unknown argument: '-fgcse-after-reload' Log
btscanner 2.1-5.1clang: error: unknown argument: '-falign-labels' Log
cain 1.9-7clang: error: unknown argument: '-finline-limit=6000' Log
cairo-ocaml 1:1.2.0-5.1clang: error: unknown argument: '-fno-defer-pop' Log
calf 0.0.19+git20140527+e79ddef54-1clang: error: unknown argument: '-finline-limit=80' Log
camlbz2 0.6.0-6clang: error: unknown argument: '-fno-defer-pop' Log
camldbm 1.0-2clang: error: unknown argument: '-fno-defer-pop' Log
camlidl 1.05-14clang: error: unknown argument: '-fno-defer-pop' Log
camlzip 1.05-3clang: error: unknown argument: '-fno-defer-pop' Log
code-saturne 3.2.2-1clang: error: unknown argument: '-fexcess-precision=fast' Log
coq 8.4pl3dfsg-1clang: error: unknown argument: '-fno-defer-pop' Log
cpp-netlib 0.11.0-1clang: error: unknown argument: '-ftemplate-dempth=256' Log
crawl 2:0.14.1-1clang: error: unknown argument: '-fwhole-program' Log
cryptokit 1.9-2clang: error: unknown argument: '-fno-defer-pop' Log
cudf 0.7-2clang: error: unknown argument: '-fno-defer-pop' Log
dh-ada-library 6.1clang: error: unknown argument: '-gnatea' Log
dietlibc 0.33~cvs20120325-6clang: error: unknown argument: '-mfancy-math-387' Log
dino 0.2.8-3clang: error: unknown argument: '-fno-default-inline' Log
dochelp 0.1.2clang: error: unknown argument: '-fno-defer-pop' Log
dose3 3.2.2-1clang: error: unknown argument: '-fno-defer-pop' Log
efivar 0.10-2clang: error: unknown argument: '-fno-merge-constants' Log
eq10q 2.0~beta5.1~repack0-2clang: error: unknown argument: '-finline-functions-called-once' Log
fact++ 1.6.2~dfsg-2clang: error: unknown argument: '-finline-limit=1200' Log
flare 0.18-1clang: error: unknown argument: '-fwhole-program' Log
frama-c 20140301+neon+dfsg-3clang: error: unknown argument: '-fno-defer-pop' Log
freewheeling 0.6-2clang: error: unknown argument: '-falign-loops=2' Log
ftp.app 0.3-1clang: error: unknown argument: '-z' Log
gforth 0.7.2+dfsg1-1clang: error: unknown argument: '-fno-defer-pop' Log
ggcov 0.9-6clang: error: unknown argument: '-fno-implement-inlines' Log
gnade 1.6.2-9clang: error: unknown argument: '-gnatea' Log
gnu-efi 3.0v-2clang: error: unknown argument: '-fno-merge-constants' Log
gnustep-dl2 0.12.0-11clang: error: unknown argument: '-z' Log
gprbuild 2013-1clang: error: unknown argument: '-gnatea' Log
gpsshogi 0.6.0-3clang: error: unknown argument: '-fpeel-loops' Log
haxe 1:3.0.0~svn6707-4clang: error: unknown argument: '-fno-defer-pop' Log
hexter 1.0.2-3clang: error: unknown argument: '-finline-limit=5000' Log
hydrogen 0.9.6~beta3-1clang: error: unknown argument: '-fno-implement-inlines' Log
i7z 0.27.2-2clang: error: unknown argument: '-fno-schedule-insns2' Log
insserv 1.14.0-5clang: error: unknown argument: '-falign-loops=0' Log
ioquake3 1.36+u20140319+gb099255-1clang: error: unknown argument: '-falign-jumps=2' Log
ip4r 2.0.2-1clang: error: unknown argument: '-fexcess-precision=standard' Log
ir.lv2 1.3.2~dfsg0-1clang: error: unknown argument: '-z' Log
jocaml 4.01.0-3clang: error: unknown argument: '-fno-defer-pop' Log
lablgl 1:1.05-1clang: error: unknown argument: '-fno-defer-pop' Log
lablgtk2 2.16.0+dfsg-1clang: error: unknown argument: '-fno-defer-pop' Log
lame 3.99.5+repack1-3clang: error: unknown argument: '-fbranch-count-reg' Log
libaal 1.0.5-6clang: error: unknown argument: '-malign-jumps=1' Log
libccaudio2 2.1.1-1clang: error: unknown argument: '-fno-check-new' Log
libccrtp 2.0.6-3clang: error: unknown argument: '-fno-check-new' Log
libflorist 2013-1clang: error: unknown argument: '-gnatea' Log
libgmpada 0.0.20131223-2clang: error: unknown argument: '-gnatea' Log
libgtkada 2.24.4-1clang: error: unknown argument: '-fstack-check' Log
libkolab 0.4.2-7.2clang: error: unknown argument: '-fno-check-new' Log
liblog4ada 1.2-4clang: error: unknown argument: '-gnatea' Log
libnxt 0.3-2clang: error: unknown argument: '-z' Log
libosl 0.6.0-3clang: error: unknown argument: '-fpeel-loops' Log
libreoffice 1:4.2.4-4clang: error: unknown argument: '-zI' Log
libtexttools 2.1.0-6clang: error: unknown argument: '-gnatea' Log
libtheora 1.1.1+dfsg.1-3.2clang: error: unknown argument: '-fforce-addr' Log
libxmlada 4.4.0puregpl-1clang: error: unknown argument: '-gnatea' Log
libxmlezout 1.06.1-6clang: error: unknown argument: '-gnatec=/«PKGBUILDDIR»/debian/build_obj_static/GNAT-TEMP-000001.TMP' Log
libzrtpcpp 2.3.4-1clang: error: unknown argument: '-fno-check-new' Log
m2vrequantiser 1.1-1clang: error: unknown argument: '-frename-registers' Log
mldonkey 3.1.5-1clang: error: unknown argument: '-fno-defer-pop' Log
mlt 0.9.0+dfsg1-1clang: error: unknown argument: '-fno-tree-dominator-opts' Log
monotone-viz 1.0.2-3clang: error: unknown argument: '-fno-defer-pop' Log
motif 2.3.4-5clang: error: unknown argument: '-fno-tree-ter' Log
music123 16.3-6clang: error: unknown argument: '-gnatea' Log
nekobee 0.1.7-4clang: error: unknown argument: '-finline-limit=5000' Log
nestopia 1.45+dfsg-2clang: error: unknown argument: '-finline-limit=2000' Log
node-contextify 0.1.6-1clang: error: unknown argument: '-fno-tree-vrp' Log
node-mapnik 1.2.3-1clang: error: unknown argument: '-fno-tree-vrp' Log
node-sqlite3 2.2.0+ds1-1clang: error: unknown argument: '-fno-tree-vrp' Log
node-srs 0.3.2+ds1-1clang: error: unknown argument: '-fno-tree-vrp' Log
node-topcube 0.2.0+ds1-1clang: error: unknown argument: '-fno-tree-vrp' Log
node-ws 0.4.30-1clang: error: unknown argument: '-fno-tree-vrp' Log
node-zipfile 0.5.0+ds-1clang: error: unknown argument: '-fno-tree-vrp' Log
nss-passwords 0.1.1-1clang: error: unknown argument: '-fno-defer-pop' Log
ocaml 4.01.0-4clang: error: unknown argument: '-fno-defer-pop' Log
ocaml-ctypes 0.2.3-1clang: error: unknown argument: '-fno-defer-pop' Log
ocaml-dbus 0.29-3clang: error: unknown argument: '-fno-defer-pop' Log
ocaml-expat 0.9.1+debian1-7clang: error: unknown argument: '-fno-defer-pop' Log
ocaml-extunix 0.1.0-1clang: error: unknown argument: '-fno-defer-pop' Log
ocaml-gettext 0.3.4-1clang: error: unknown argument: '-fno-defer-pop' Log
ocaml-inotify 1.0-1clang: error: unknown argument: '-fno-defer-pop' Log
ocaml-sha 1.9-1clang: error: unknown argument: '-fno-defer-pop' Log
ocaml-sqlite3 2.0.5-1clang: error: unknown argument: '-fno-defer-pop' Log
ocaml-usb 1.3.0-2clang: error: unknown argument: '-fno-defer-pop' Log
ocaml-zarith 1.2.1-2clang: error: unknown argument: '-fno-defer-pop' Log
ocamlagrep 1.0-11clang: error: unknown argument: '-fno-defer-pop' Log
ocamlbricks 0.90+bzr393-1clang: error: unknown argument: '-fno-defer-pop' Log
ocamlgsl 0.6.0-7clang: error: unknown argument: '-fno-defer-pop' Log
ocamlnet 3.7.3-3clang: error: unknown argument: '-fno-defer-pop' Log
ocamlpam 1.1-4clang: error: unknown argument: '-fno-defer-pop' Log
ocamlsdl 0.9.1-2clang: error: unknown argument: '-fno-defer-pop' Log
ocurl 0.5.3-2clang: error: unknown argument: '-fno-defer-pop' Log
oidentd 2.0.8-5clang: error: unknown argument: '-fvar-tracking' Log
open-jtalk 1.07-2clang: error: unknown argument: '-finput-charset=UTF-8' Log
openarena 0.8.8-9clang: error: unknown argument: '-falign-jumps=2' Log
opentoken 5.0a-1clang: error: unknown argument: '-gnatea' Log
orafce 3.0.6-1clang: error: unknown argument: '-fexcess-precision=standard' Log
orpie 1.5.1-10clang: error: unknown argument: '-fno-defer-pop' Log
pagodacf 0.10-3clang: error: unknown argument: '-fno-defer-pop' Log
pcre-ocaml 7.0.4-1clang: error: unknown argument: '-fno-defer-pop' Log
pg-comparator 2.2.2-1clang: error: unknown argument: '-fexcess-precision=standard' Log
pgfincore 1.1.2-1clang: error: unknown argument: '-fexcess-precision=standard' Log
pgmemcache 2.1.2-2clang: error: unknown argument: '-fexcess-precision=standard' Log
pgpool2 3.3.3-2clang: error: unknown argument: '-fexcess-precision=standard' Log
pgrouting 2.0.0-2clang: error: unknown argument: '-fno-delete-null-pointer-checks' Log
pgsql-asn1oid 0.0.20100818-3clang: error: unknown argument: '-fexcess-precision=standard' Log
phasex 0.14.97-2clang: error: unknown argument: '-fsingle-precision-constant' Log
plr 1:8.3.0.15-2clang: error: unknown argument: '-fexcess-precision=standard' Log
plv8 1.4.2.ds-1clang: error: unknown argument: '-fexcess-precision=standard' Log
poppler 0.24.5-4clang: error: unknown argument: '-fno-check-new' Log
postgis 2.1.3+dfsg-3clang: error: unknown argument: '-fexcess-precision=standard' Log
postgresql-ocaml 2.0.5-1clang: error: unknown argument: '-fno-defer-pop' Log
postgresql-pgmp 1.0.1-4clang: error: unknown argument: '-fexcess-precision=standard' Log
postgresql-pljava 1.4.3-3clang: error: unknown argument: '-fexcess-precision=standard' Log
postgresql-pllua 1:1.0-3clang: error: unknown argument: '-fexcess-precision=standard' Log
postgresql-plproxy 2.5-4clang: error: unknown argument: '-fexcess-precision=standard' Log
postgresql-plsh 1.20140221-1clang: error: unknown argument: '-fexcess-precision=standard' Log
postgresql-prioritize 1.0.4-1clang: error: unknown argument: '-fexcess-precision=standard' Log
preview.app 0.8.5-9clang: error: unknown argument: '-z' Log
python2.7 2.7.7-2clang: error: unknown argument: '-fuse-linker-plugin' Log
python3.4 3.4.1-6clang: error: unknown argument: '-fuse-linker-plugin' Log
reiser4progs 1.0.8-1clang: error: unknown argument: '-malign-jumps=1' Log
repmgr 2.0-1clang: error: unknown argument: '-fexcess-precision=standard' Log
ruby-nora 1:0.0.20041021-5.1clang: error: unknown argument: '-fno-tree-dce' Log
sbc 1.2-3clang: error: unknown argument: '-fgcse-after-reload' Log
scheme2c 2012.10.14-1clang: error: unknown argument: '-frename-registers' Log
sipwitch 1.6.1-1clang: error: unknown argument: '-fno-check-new' Log
skytools 2.1.13-4clang: error: unknown argument: '-fexcess-precision=standard' Log
skytools3 3.1.5-1clang: error: unknown argument: '-fexcess-precision=standard' Log
soundtouch 1.7.1-5clang: error: unknown argument: '-fcheck-new' Log
spark 2012.0.deb-9clang: error: unknown argument: '-gnatea' Log
stardict 3.0.1-9.2clang: error: unknown argument: '-ffriend-injection' Log
swh-plugins 0.4.15+1-7clang: error: unknown argument: '-malign-double' Log
taopm 1.0-3clang: error: unknown argument: '-finline-limit=100' Log 755174
whysynth 20090403-1.2clang: error: unknown argument: '-finline-limit=5000' Log
wsynth-dssi 0.1.3-4clang: error: unknown argument: '-finline-limit=5000' Log
wvdial 1.61-4.1clang: error: unknown argument: '-fno-implement-inlines' Log
xnbd 0.3.0-1clang: error: unknown argument: '-fstack-check' Log
zeroinstall-injector 2.7-1clang: error: unknown argument: '-fno-defer-pop' Log
zmap 1.2.0-1clang: error: unknown argument: '-z' Log
148 errors
Return to the list