Debian Package rebuild

Rebuild of the Debian archive with clang

"Expected declaration (#define missing?)" build failure(s)
clang 3.5.0
Return to the list

Versions: 2.9 - 3.0 - 3.1 - 3.2 - 3.3 - 3.4 - 3.4.2 - 3.5.0 - 3.6.0 - 3.8.1
PackageVersionSupposed error messageFull log Bug report
ats-lang-anairiats 0.2.11-1bool.cats:42:5: error: expected parameter declarator Log
autounit 0.20.1-4test.c:305:7: error: expected expression Log 755961
chasen 2.4.5-12print.c:186:16: error: expected parameter declarator Log
clearsilver 0.10.5-1.4neo_files.c:219:12: error: expected expression Log 755963
dcap 2.47.8-2./util.h:14:12: error: expected parameter declarator Log 755964
distcc 3.1-6src/snprintf.h:30:5: error: expected parameter declarator Log
fakechroot 2.17.2-1./libfakechroot.h:211:5: error: expected parameter declarator Log
fribidi 0.19.6-2fribidi-char-sets-cap-rtl.c:109:6: error: expected expression Log
gosmore 0.0.0.20100711-2.1libgosm.cpp:147:53: error: expected ')' Log 756077
gr-iqbal 0.37.2-1cxvec.h:45:15: error: expected ';' at end of declaration list Log
icinga 1.11.6-1./../include/snprintf.h:29:5: error: expected parameter declarator Log
ivtools 1.2.11a1-2src/Unidraw/catalog.cc:663:45: error: expected ')' Log
libesmtp 1.0.6-4./missing.h:48:5: error: expected parameter declarator Log
libiberty 20140612-1../libiberty/../include/libiberty.h:616:12: error: expected parameter declarator Log
libspf2 1.2.10-4spf_compile.c:580:5: error: expected expression Log
mawk 1.3.3-17print.c:85:11: error: expected parameter declarator Log
mcelog 102-1memutil.c:66:5: error: expected parameter declarator Log
moc 1:2.5.0-1numeric_traits.h:63:25: error: expected member name or ';' after declaration specifiers Log
mtools 4.0.18-1mainloop.c:89:15: error: expected ')' Log
netpipe 3.7.2-7mpi.h:118:56: error: expected identifier Log
pchar 1.5-2./pc.h:28:15: error: expected identifier Log
re2 20140304+dfsg-2re2/dfa.cc:1116:38: error: expected function body after function declarator Log
sdpa 7.3.9+dfsg-1mexFprintf.c:32:5: error: expected parameter declarator Log
sentinella 0.9.2-4MainWindow.h:70:33: error: expected ';' at end of declaration list Log
urjtag 0.10+r2007-1.1../../include/libiberty.h:589:12: error: expected parameter declarator Log
visualboyadvance 1.8.0.dfsg-2debugger.cpp:1725:36: error: expected ')' Log
xine-lib-1.2 1.2.6-1eq2.c:128:5: error: expected ')' in parentheses expression Log
27 errors
Return to the list