Debian Package rebuild

Rebuild of the Debian archive with clang

"No support of nested C function" build failure(s)
clang 3.5.0
Return to the list
clang rejects inner functions while gcc accepts them.
void foo() {

     void bar() {

     }

}

Versions: 2.9 - 3.0 - 3.1 - 3.2 - 3.3 - 3.4 - 3.4.2 - 3.5.0 - 3.6.0 - 3.8.1 - 3.9.1 - 4.0.1 - 5.0
PackageVersionSupposed error messageFull log Bug report
bogl 0.1.18-9bogl-font.c:84:3: error: function definition is not allowed here Log 758063
elfutils 0.159-4elf_begin.c:1036:3: error: function definition is not allowed here Log 758064
eurephia 1.1.0-4eurephiadm.c:203:47: error: function definition is not allowed here Log
freedroidrpg 0.15.1-1quest_browser_ui.c:609:4: error: function definition is not allowed here Log 758161
gambas3 3.5.4-1gb_error.c:94:3: error: function definition is not allowed here Log
gimp-plugin-registry 7.20140602./refinerThreaded.h:298:3: error: function definition is not allowed here Log 758451
kraptor 0.0.20040403-8src/game.c:416:3: error: function definition is not allowed here Log 750370
libhdate 1.6-2.1././local_functions.c:672:2: error: function definition is not allowed here Log 758453
libsx 2.05-5popups.c:71:3: error: function definition is not allowed here Log 758560
mandos 1.6.8-1plugin-runner.c:430:66: error: function definition is not allowed here Log 750516
matchbox-panel 0.9.3-8.1mb-applet-battery.c:182:2: error: function definition is not allowed here Log 750784
netplug 1.2.9.2-1if_info.c:294:37: error: function definition is not allowed here Log 750789
openrc 0.12.4+20131230-9librc-depend.c:1249:90: error: function definition is not allowed here Log 758564
p3scan 2:2.3.2-8.1p3scan.c:2418:83: error: function definition is not allowed here Log 750874
paxtest 1:0.9.11-2body.c:40:19: error: function definition is not allowed here Log 758566
rainbow 0.8.7-1nss-rainbow.c:287:39: error: function definition is not allowed here Log 758571
ratpoints 1:2.1.3-1./sturm.c:176:5: error: function definition is not allowed here Log
rawstudio 2.0-2rs-tag-gui.c:103:2: error: function definition is not allowed here Log
rsh-redone 85-2rlogin.c:388:30: error: function definition is not allowed here Log 750957
slurm-llnl 2.6.7-2dist_tasks.c:321:2: error: function definition is not allowed here Log
smbc 1.2.2-4smbc.c:316:2: error: function definition is not allowed here Log
spl 1.0~pre6-4spl_modules/mod_format_xml.c:188:2: error: function definition is not allowed here Log 741605
systemtap 2.3-2.3loc2c.c:344:5: error: function definition is not allowed here Log
upstart 1.11-3tests/test_initctl.c:3464:35: error: function definition is not allowed here Log 737757
w-scan 20130331-1descriptors.c:1014:35: error: function definition is not allowed here Log 744323
25 errors
Return to the list