Debian Package rebuild

Rebuild of the Debian archive with clang

"Not categorized" build failure(s)
clang 3.5.0
Return to the list

Versions: 2.9 - 3.0 - 3.1 - 3.2 - 3.3 - 3.4 - 3.4.2 - 3.5.0 - 3.6.0 - 3.8.1 - 3.9.1 - 4.0.1 - 5.0
PackageVersionSupposed error messageFull log Bug report
pcsc-cyberjack 3.99.5final.sp05-2CCIDReader.cpp:3118:77: error: invalid use of non-static data member 'abData' Log
libomxvorbis 0.1-3configure: error: in `/«PKGBUILDDIR»' Log
libomxvideosrc 0.1-1configure: error: in `/«PKGBUILDDIR»' Log
libomxcamera 0.1-2configure: error: in `/«PKGBUILDDIR»' Log
libomxfbdevsink 0.1-2configure: error: in `/«PKGBUILDDIR»' Log
judy 1.0.5-3configure: error: in `/«PKGBUILDDIR»' Log
fsvs 1.2.5-1configure: error: in `/«PKGBUILDDIR»' Log
popplerkit.framework 0.0.20051227svn-7.1ld: warning: cannot find entry symbol _start; defaulting to 00000000004001c0 Log
lvtk 1.1.1~dfsg0-1ui_features.hpp:47:45: error: assigning to 'mapped_type' (aka 'void (*)(void *, void *)') from incompatible type 'void (*)(void *, FeatureData *)': type mismatch at 2nd parameter ('void *' vs 'FeatureData *' (aka 'void **')) Log
avw.lv2 0.1.6~dfsg0-1ui_features.hpp:47:45: error: assigning to 'mapped_type' (aka 'void (*)(void *, void *)') from incompatible type 'void (*)(void *, FeatureData *)': type mismatch at 2nd parameter ('void *' vs 'FeatureData *' (aka 'void **')) Log
traverso 0.49.2-6Tsar.h:66:9: error: field has incomplete type 'void *[]' Log
ncmpcpp 0.5.10-2./screen.h:265:3: error: cannot initialize object parameter of type 'NCurses::Window' with an expression of type 'NCurses::Scrollpad' Log
mesa 10.2.6-1../../../../../../src/gallium/state_trackers/clover/util/adaptor.hpp:47:16: error: function cannot return function type 'clover::device &(_cl_device_id *)' Log
ufraw 0.19.2-2Dependencies installation failed Log
qtwebkit 2.3.2.dfsg-1Dependencies installation failed Log
openvswitch 2.3.0+git20140819-2../lib/ovs-atomic.h:320:5: error: address argument to atomic operation must be a pointer to integer or pointer ('atomic_uint *' (aka '_Atomic(unsigned int) *') invalid) Log
postgresql-9.4 9.4~beta2-1configure: error: thread test program failed Log
postgresql-9.3 9.3.4-2configure: error: thread test program failed Log
postgresql-9.1 9.1.14-0+deb8u1configure: error: thread test program failed Log
acpid 1:2.0.23-1configure: error: "asprintf() not found" Log
hugs98 98.200609.21-5.3tools/make_bootlib: 68: tools/make_bootlib: -D__HUGS__: not found Log
ffrenzy 1.0.2~svn20070530-5configure: error: *** SDL version 1.2.0 not found! Log 751442
aconnectgui 0.9.0rc2-1-9configure: error: Sufficiently new version of libasound not found. Log 684508
suricata 2.0.3-1configure: error: pcre.h not found ... Log
libncursesada 5.9.20140726-1configure: error: No usable Ada compiler found Log
libosl 0.6.0-3.1clang: error: optimization flag '-funswitch-loops' is not supported Log
uwsgi 2.0.6~dfsg-8clang: error: optimization flag '-fexcess-precision=standard' is not supported Log
xbubble 0.5.11.2-3.2clang: error: optimization flag '-finline-functions' is not supported Log
doxymacs 1.8.0-6clang: error: optimization flag '-fexpensive-optimizations' is not supported Log
pennmush 1.8.2p8-1.1atr_tab.c:217:19: error: operand of type 'void' where arithmetic or pointer type is required Log
libomxxvideo 0.1-2configure: error: POSIX threads support is required Log
libomxmad 0.1-1configure: error: POSIX threads support is required Log
libomxalsa 0.1-2configure: error: POSIX threads support is required Log
libomxil-bellagio 0.9.3-2configure: error: libdl is required Log
avifile 1:0.7.48~20090503.ds-16common/avm_output.cpp:20:12: error: qualified reference to 'AvmOutput' is a constructor name rather than a type wherever a constructor can be declared Log
prime-phylo 1.0.11-1PrimeOptionMap.hh:161:32: error: no function named 'operator<<' with type 'std::ostream &(std::ostream &, const beep::PrimeOptionMap &)' was found in the specified scope Log
aeskulap 0.2.2b1-13./poolinstance.h:53:25: error: no function named 'remove_instance' with type 'void (const Glib::RefPtr &)' was found in the specified scope Log
freefoam 0.1.0+dfsg-1.1Pstream.H:518:29: error: no function named 'reduce' with type 'void (scalar &, const sumOp &)' was found in the specified scope Log
dicom3tools 1.00~20140527121828-1./Imakefile:171:3: error: invalid preprocessing directive Log
kannel 1.4.3-2test/test_octstr_format.c:66:28: error: integer constant is larger than the largest unsigned integer type Log
libkdtree++ 0.7.1+git20101123-3kdtree.hpp:1207:28: error: invalid operands to binary expression ('basic_ostream >' and 'const KDTree::_Node_base') Log
xen 4.4.0-4RuntimeError: Can't find /usr/src/linux-support-3.14-2, please install the linux-support-3.14-2 package Log
qlandkartegt 1.7.7-3Dictionary.h:69:46: error: call to non-static member function 'left2right' of 'Dictionary' from nested type 'iterator_base' Log
mypaint 1.1.0-3ImportError: ../_mypaintlib.so: undefined symbol: _ZN10BufferCompIL20BufferCompOutputType1ELj16384E12HueBlendModeE9blendfuncE Log
ns2 2.35+dfsg-1.1common/tclAppInit.cc:240:26: error: declaration of 'globalMemTrace' has a different language linkage Log
pdftk 2.02-1javaprims.h:40:8: error: unknown linkage language Log
obexftp 0.23-4bfb_io.c:415:44: error: hex escape sequence out of range Log
blktap 2.0.90-2libvhd.c:1073:2: error: indirection of non-volatile null pointer will be deleted, not trap [-Werror,-Wnull-dereference] Log
ax25-tools 0.0.10-rc2+cvs20120204-3./rip98d.h:47:12: error: restrict requires a pointer or reference Log
openmpi 1.6.5-8dh_auto_test: make -j10 check returned exit code 2 Log
open-cobol 1.1-1dh_auto_test: make -j1 check returned exit code 2 Log
minc 2.2.00-5dh_auto_test: make -j1 check returned exit code 2 Log 741744
meep 1.2.1-2dh_auto_test: make -j1 check returned exit code 2 Log
m4 1.4.17-4dh_auto_test: make -j1 check returned exit code 2 Log
libvirt 1.2.7-11dh_auto_test: make -j10 check returned exit code 2 Log
igraph 0.7.1-2dh_auto_test: make -j10 check returned exit code 2 Log
hardening-wrapper 2.5+nmu1dh_auto_test: make -j1 check returned exit code 2 Log
gnutls28 3.3.7-2dh_auto_test: make -j10 check returned exit code 2 Log
cutter-testing-framework 1.2.4-1dh_auto_test: make -j1 check returned exit code 2 Log
cssc 1.3.0-4dh_auto_test: make -j10 check returned exit code 2 Log
audiofile 0.3.6-2dh_auto_test: make -j10 check returned exit code 2 Log
spring 97.0+dfsg-1dh_auto_test: make -j10 test ARGS+=-j10 returned exit code 2 Log
oce 0.15-4dh_auto_test: make -j10 test ARGS+=-j10 returned exit code 2 Log
cmocka 0.4.1-2dh_auto_test: make -j1 test ARGS+=-j1 returned exit code 2 Log
python-cffi 0.8.6-1dh_auto_test: pybuild --test -i python{version}-dbg -p 2.7 --dir . returned exit code 13 Log
mwrap 0.33-1dh_auto_test: make -j1 test returned exit code 2 Log
libb-hooks-parser-perl 0.12-1dh_auto_test: make -j1 test returned exit code 2 Log
libapache2-mod-perl2 2.0.8+httpd24-r1449661-9dh_auto_test: make -j1 test returned exit code 2 Log
cmake 2.8.12.2-1main.s:23:2: error: input can't have .file dwarf directives when -g is used to generate dwarf debug info for assembly code Log
coinor-flopc++ 1.0.6-3.1./MP_domain.hpp:180:18: error: return type of virtual function 'getSet' is not covariant with the return type of the function it overrides ('flopc::MP_set_base' is incomplete) Log
aplus-fsf 4.22.1-6../MSTypes/MSFloatMatrix.H:30:7: error: template specialization requires 'template<>' Log
mira 4.0.2-1clang: error: argument to '-V' is missing (expected 1 value) Log
scantailor 0.9.11.1-2MatrixCalc.h:127:10: error: calling a private constructor of class 'mcalc::Mat' Log
bomberclone 0.11.9-4../include/gfx.h:108:20: error: inline function 'gfx_blitupdaterectclear' is not defined [-Werror,-Wundefined-inline] Log
ekg2 1:0.4~pre+20120506.1-8Makefile.am:144: error: 'plugins/autoresponder/autoresponder.la' is not a standard libtool library name Log
lookup 1.08b-11lib/romaji2kana.c:59:12: error: source file is not valid UTF-8 Log
dietlibc 0.33~cvs20120325-6x86_64/strcpy.S:2:8: error: alignment must be a power of 2 Log
boinc 7.4.18+dfsg-1configure: error: in `/«BUILDDIR»/boinc-7.4.18+dfsg' Log
xdb 1.2.0-7.2dh_install: libxdb1 missing files (debian/tmp/usr/lib/*.so.*), aborting Log
cigi-ccl 3.3.3a+svn818-7dh_install: libcigicl-dev missing files (usr/lib/*/pkgconfig/*), aborting Log
z80ex 1.1.21-1dh_install: libz80ex-dev missing files (usr/lib/lib*.a), aborting Log
musl 1.1.4-1dh_install: musl-tools missing files (usr/bin/*), aborting Log
linux 3.14.15-2RuntimeError: Can't upload to unstable with a version of 3.14.15-2clang1 Log
freetype 2.5.2-1.1./builds/unix/ftconfig.h:532:5: error: 'long long' is an extension when C99 mode is not enabled [-Werror,-Wlong-long] Log
xmpi 2.2.3b8-13.2configure: error: cannot continue -- cannot find Log
aptitude 0.6.11-1configure: error: in `/«PKGBUILDDIR»/build-arch' Log
gummiboot 45-2efibind.h:29:10: error: Compiler is too old for GNU_EFI_USE_MS_ABI Log
autodocksuite 4.2.6-2configure: error: in `/«PKGBUILDDIR»/autodock' Log
gnash 0.8.11~git20140708-3agg_scanline_u.h:476:30: error: type 'base_type' (aka 'agg::scanline_u8') is not a direct or virtual base of 'scanline32_u8_am' Log
aqemu 0.8.2-2VM.cpp:4566:75: error: reference to type 'const QString' could not bind to an rvalue of type 'bool' Log
pcp 3.9.9access.o: r .L.str : Error: additional symbol Log
libgisi 0.1.0-1gisicomm.c:1848:8: error: duplicate case value: 'MTC_STATE_NONE' and 'MTC_CMT_ONLY_MODE' both equal '255' Log
aspectc++ 1:1.2-1stddef.h:53: error: unexpected token `(' in conditional Log
sks-ecc 0.93-3tfm/mpi.c:2565:15: error: unknown register name '%cc' in asm Log
freefem3d 1.0pre10-3.2libtool.m4: error: problem compiling CXX test program Log
wvdial 1.61-4.1uniconfgen.h:323:19: error: no class named 'Iter' in 'UniConfGen' Log
insighttoolkit4 4.6.0-3stddef.h:53:39: error: missing binary operator before token "(" Log
activiz.net 1:1.0~git20111214-2stddef.h:53:39: error: missing binary operator before token "(" Log
xhprof 0.9.4-1configure: error: in `/«PKGBUILDDIR»/extension' Log
sheepdog 0.8.3-1:1:9: error: unknown token in expression Log
styx 2.0.1-1sysbase1.c:579:50: error: invalid token at start of a preprocessor expression Log
modemmanager 1.2.0-1commands.c:1444:16: error: expression which evaluates to zero treated as a null pointer constant of type 'QcdmResult *' (aka 'struct QcdmResult *') [-Werror,-Wnon-literal-null-conversion] Log
turnserver 0.7.3-2turnserver.c:959:57: error: size argument in 'memcmp' call is a comparison [-Werror,-Wmemsize-comparison] Log
ember 0.6.2+dfsg-2.1CEGUIWindowFactoryManager.h:486:9: error: cannot catch reference to incomplete type 'CEGUI::Exception' Log
cegui-mk2 0.7.6-3.3../../cegui/include/CEGUIWindowFactoryManager.h:486:9: error: cannot catch reference to incomplete type 'CEGUI::Exception' Log
comedilib 0.10.2-2clang: error: clang frontend command failed with exit code 70 (use -v to see invocation) Log
clisp 1:2.49-10clang: error: clang frontend command failed with exit code 70 (use -v to see invocation) Log
tcc 0.9.26~git20120612.ad5f375-6libtcc1.c:673:45: error: too few arguments provided to function-like macro invocation Log
9base 1:6-6n1.c:124:5: error: unterminated function-like macro invocation Log
idjc 0.8.14-1configure: error: "math library is missing critical function" Log
reprepro 4.16.0-1sourceextraction.c:135:2: error: illegal storage class on function Log
cone 0.89-1cursesmessage.C:3764:18: error: cannot create a non-constant pointer to member function Log
openhpi 2.14.1-1.4ipmi.cpp:1563:83: error: alias must point to a defined variable or function Log
imvirt 0.9.6-1vmware.c:65:5: error: invalid operand for instruction Log
ogmrip 1.0.1-1ogmrip-encoding.c:1200:7: error: cast to union type from type 'int' not present in union Log
lierolibre 0.5-1src/gvl/io/encoding.hpp:586:19: error: cast from pointer to smaller type 'uint32_t' (aka 'unsigned int') loses information Log
libindi 0.9.8.1-5mathcalls.h:309:14: error: exception specification in declaration does not match previous declaration Log
npapi-vlc 2.0.6-4./control/nporuntime.h:225:13: error: static declaration of 'RuntimeNPClassGetProperty' follows non-static declaration Log
librg-blast-parser-perl 0.03-2blast-parser-driver.h:61:12: error: 'token_type' (aka 'rostlab::blast::parser::token::yytokentype') is not a class, namespace, or scoped enumeration Log
librostlab-blast 1.0.1-3./rostlab/blast-parser-driver.h:61:12: error: 'token_type' (aka 'rostlab::blast::parser::token::yytokentype') is not a class, namespace, or scoped enumeration Log
helpviewer.app 0.3-8clang: error: invalid value 'ISO-8859-1' in '-finput-charset=ISO-8859-1' Log
pingus 0.7.6-2src/lisp/getters.hpp:33:15: error: no viable conversion from 'std::shared_ptr' to 'const lisp::Lisp *' Log
canl-c++ 1.1.0-1make[2]: *** No rule to make target '', needed by 'canl_wrap.cpp'. Stop. Log
nn 6.7.3-8make[2]: *** No rule to make target ' articles.h', needed by 'nn.o'. Stop. Log
triggerhappy 0.3.4-2make[1]: *** No rule to make target 'evtable_EV.h', needed by 'eventnames.o'. Stop. Log
vdr-plugin-xineliboutput 1.1.0-1make[2]: *** No rule to make target 'dbus/dbus-glib.h', needed by 'tools/gnome_screensaver.o'. Stop. Log
gmerlin 1.2.0~dfsg+1-3bgyadif.c:769:9: error: ambiguous instructions require an explicit suffix (could be 'cmpb', 'cmpw', 'cmpl', or 'cmpq') Log
rawtherapee 4.1-1dcraw.cc:8668:11: error: '(anonymous union at /«PKGBUILDDIR»/rtengine/dcraw.cc:8668:11)' cannot be defined in a type specifier Log
389-dsgw 1.1.11-1../edit.c:30:5: error: third parameter of 'main' (environment) must be of type 'char **' Log
worker 3.4.1-1configure: error: Log
fvwm 1:2.6.5.ds-3configure: error: " Log
rampart 1.3.0-3error.c:91:5: error: implicitly declaring library function 'vsnprintf' with type 'int (char *, unsigned long, const char *, __va_list_tag *)' [-Werror] Log
gdal 1.10.1+dfsg-8gdal_wrap.cpp:4494:12: error: assigning to 'char *' from incompatible type 'const char *' Log
root-system 5.34.19+dfsg-1NameLookup.cxx:243:32: error: declaration of reference variable 'name' requires an initializer Log
xcftools 1.0.7-4Undetected errorLog
whois 5.1.5Undetected errorLog
wesnoth-1.11 1:1.11.16-1Undetected errorLog
wesnoth-1.10 1:1.10.7-1Undetected errorLog
vboot-utils 0~20121212-3Undetected errorLog
tudu 0.8.2-1Undetected errorLog
troffcvt 1.04-21Undetected errorLog
zzuf 0.13.svn20100215-4.1Undetected errorLog
tpb 0.6.4-8Undetected errorLog
supercollider 1:3.6.3~repack-6Undetected errorLog
snappy 1.1.2-3Undetected errorLog
scheme48 1.9-5Undetected errorLog
python-enable 4.3.0-1.1Undetected errorLog
pypy 2.3.1+dfsg-1Undetected errorLog
py3cairo 1.10.0+dfsg-4Undetected errorLog
paw 1:2.14.04.dfsg.2-9Undetected errorLog
openmprtl 0.20131209-1Undetected errorLog
openmsx-catapult 0.10.1-2Undetected errorLog
openlibm 0.4+dfsg-1Undetected errorLog
openclonk 5.4.1-1Undetected errorLog
octave-optim 1.4.0-1Undetected errorLog
octave-io 2.2.3-1Undetected errorLog
nast 0.2.0-6Undetected errorLog
mrs 6.0.4+dfsg-1Undetected errorLog
mongodb 1:2.4.10-2Undetected errorLog
mknbi 1.4.4-10Undetected errorLog
megaglest 3.7.1-4Undetected errorLog
mclibs 20061220+dfsg3-3Undetected errorLog
linux-latest 59Undetected errorLog
linux-tools 3.14-1Undetected errorLog
lightspark 0.7.2-5Undetected errorLog
libwx-scintilla-perl 0.39-1Undetected errorLog
libwx-perl 1:0.9923-3Undetected errorLog
libtemplates-parser 11.8.2014-3Undetected errorLog
libguestfs 1:1.26.8-1Undetected errorLog
libgnatcoll 1.6gpl2014-4Undetected errorLog
libdbi-drivers 0.9.0-3Undetected errorLog
lcgdm 1.8.7-3.1Undetected errorLog
hylafax 3:6.0.6-5Undetected errorLog
haskell-yesod-form 1.3.15-1Undetected errorLog
haxml 1:1.23.3-2Undetected errorLog
haskell-vector 0.10.0.1-3Undetected errorLog
haskell-uniplate 1.6.11-2Undetected errorLog
haskell-vector-space 0.8.6-3Undetected errorLog
haskell-parallel 3.2.0.4-1Undetected errorLog
haskell-text 0.11.3.1-1Undetected errorLog
haskell-openglraw 1.3.0.0-2Undetected errorLog
haskell-notmuch-web 0.2.0-7Undetected errorLog
haskell-network 2.4.1.2-2Undetected errorLog
haskell-lifted-base 0.2.0.3-2Undetected errorLog
haskell-ltk 0.12.1.0-3Undetected errorLog
haskell-glut 2.4.0.0-1Undetected errorLog
haskell-hscurses 1.4.1.2-2Undetected errorLog
haskell-gluraw 1.3.0.0-2Undetected errorLog
haskell-fclabels 1.1.4.3-2Undetected errorLog
haskell-esqueleto 1.4.1.2-1Undetected errorLog
haskell-categories 1.0.6-1Undetected errorLog
haskell-conduit 1.1.6-1Undetected errorLog
gringo 4.4.0-1Undetected errorLog
gprolog 1.3.0-6.1Undetected errorLog
golang 2:1.3.1-1Undetected errorLog
google-glog 0.3.3-2Undetected errorLog
glib2.0 2.40.0-5Undetected errorLog
glibmm2.4 2.40.0-1Undetected errorLog
giftrans 1.12.2-18Undetected errorLog
ggcov 0.9-6Undetected errorLog
gforth 0.7.2+dfsg1-1Undetected errorLog
geant321 1:3.21.14.dfsg-11Undetected errorLog
gbsplay 0.0.91-1Undetected errorLog
gamera 3.4.1+svn1422-1Undetected errorLog
docker.io 1.0.0~dfsg1-1Undetected errorLog
dmapi 2.2.10-1Undetected errorLog
dacs 1.4.28b-3Undetected errorLog
csound 1:6.03.2~dfsg-1Undetected errorLog
cook 2.33-1Undetected errorLog
cgal 4.4-2Undetected errorLog
cernlib 20061220+dfsg3-4.1Undetected errorLog
blas 1.2.20110419-7Undetected errorLog
atlas 3.10.2-2Undetected errorLog
arj 3.10.22-12Undetected errorLog
apt 1.0.7Undetected errorLog
apq-postgresql 3.2.0-2.1Undetected errorLog
apbs 1.4-1Undetected errorLog
agda 2.4.0.2-2Undetected errorLog
aegis 4.24.3-3Undetected errorLog
zeroc-ice 3.5.1-6lex.yy.c:805:2: error: 'register' storage class specifier is deprecated [-Werror,-Wdeprecated-register] Log
rheolef 6.5-1:1352:2: error: 'register' storage class specifier is deprecated [-Werror,-Wdeprecated-register] Log
zeitgeist 0.9.14-2.2controller.cpp:131:19: error: cannot cast from type 'gboolean (ZeitgeistFTS::Controller::*)()' to pointer type 'GSourceFunc' (aka 'gboolean (*)(gpointer)') Log
esys-particle 2.3-2./SphAggGougeBlock.hpp:39:37: error: no viable conversion from '__normal_iterator' to '__normal_iterator' Log
fftw3 3.3.4-1openmp.c:26:2: error: OpenMP enabled but not using an OpenMP compiler Log
mpich2 1.4.1-4.2configure: error: Cannot build shared libraries with this compiler Log
lensfun 0.2.8-1lensfun.h:68:13: error: "I don't know how to change symbol visibility for your compiler" Log
icewm 1.3.7-5../../src/apppstatus.cc:85:5: error: cannot delete expression of type 'YColor *[3]' Log
mozjs17 17.0.0-1 BytecodePattern(PassOwnPtr body, const Vector &allParenthesesInfo, YarrPattern& pattern, BumpPointerAllocator* allocator)/«PKGBUILDDIR»/js/src/jsinterp.cpp:3684:9: error: indirect goto might cross protected scopes Log
libv8-3.14 3.14.5.8-8../src/../include/v8.h:2990:5: error: anonymous types declared in an anonymous union are an extension [-Werror,-Wnested-anon-types] Log
wvstreams 4.6.1-7./include/wvscatterhash.h:186:46: error: invalid use of non-static data member 'xstatus' Log
sam2p 0.49.2-3configure: error: cannot compute depends Log
grub 0.97-68configure: error: GRUB requires GAS .code16 addr32 support; upgrade your binutils Log
liboil 0.3.17-2wavelet.c:1759:27: error: invalid use of a cast in a inline asm context requiring an l-value: remove the cast or build with -fheinous-gnu-extensions Log
memtest86 4.3.6-1main.c:229:2: error: indirect goto in function with no address-of-label expressions Log
memtest86+ 5.01-1main.c:223:2: error: indirect goto in function with no address-of-label expressions Log
ocl-icd 2.1.3-5run_dummy_icd_gen.c:32:34: error: unknown warning group '-Wcpp', ignored [-Werror,-Wunknown-pragmas] Log
sinfo 0.0.47-1bind.hpp:69:22: error: type 'void (*)(int) __attribute__((noreturn))' cannot be used prior to '::' because it has no members Log
libvpx 1.3.0-2.1vp8_asm_enc_offsets.c:23:1: error: unexpected token in argument list Log
grml2usb 0.14.7mbr.S:38:16: error: unexpected token in argument list Log
lordsawar 0.2.0-2.1armyproto.cpp:39:34: error: array initializer must be an initializer list Log
mandelbulber 1:1.21.1-1../src/Render3D.cpp:1412:25: error: non-aggregate type 'CVector3' cannot be initialized with an initializer list Log
regina-normal 4.96-1ninteger.h:2294:16: error: assigning to 'mpz_ptr' (aka '__mpz_struct *') from incompatible type 'mpz_t *' (aka '__mpz_struct (*)[1]') Log
mldemos 0.5.1-3./SECovarianceFunction.h:23:13: error: field has incomplete type 'float []' Log
tbb 4.2~20140122-2../../src/tbb/tools_api/ittnotify_config.h:267:33: error: unsupported inline asm: input with type 'long' matching output with type 'int' Log
obby 0.4.8-1../inc/zeroconf_avahi.hpp:135:40: error: assigning to 'AvahiWatchEvent' from incompatible type 'int' Log
guymager 0.7.3-3aewf.cpp:141:12: error: field has incomplete type 'uint []' Log
gnucap 1:0.36~20091207-2./mg_.h:134:19: error: variable has incomplete type 'C_Comment' Log
polybori 0.8.3-3PyPolyBoRi/monomial_wrapper.cc:50:64: error: call to non-static member function without an object argument Log
laserboy 2012.11.11-1LaserBoy_frame_set.hpp:259:38: error: parameter of overloaded 'operator++' cannot have a default argument Log
memcached 1.4.13-0.3testapp.c:1784:13: error: variable length array folded to constant array as an extension [-Werror,-Wgnu-folding-constant] Log
cinnamon 2.2.16-2st/st-background-effect.c:240:28: error: invalid suffix 'd' on floating constant Log
snapper 0.1.8-2stl_list.h:114:33: error: call to implicitly-deleted copy constructor of 'Client' Log
libs3 2.0-2inc/request.h:131:14: error: sizeof on pointer operation will return size of 'char *' instead of 'char [9]' [-Werror,-Wsizeof-array-decay] Log
python-admesh 0.98-1error: [Errno 2] No such file or directory Log
254 errors
Return to the list