Debian Package rebuild

Rebuild of the Debian archive with clang

"Tautological comparison" build failure(s)
clang 3.5.0
Return to the list
Always true:
int main() {
    unsigned int i = 0;
    i < 0;
    return 0;
}
gcc -Werror plop.c will accept this code while clang -Werror plop.c will fail.
Versions: 2.9 - 3.0 - 3.1 - 3.2 - 3.3 - 3.4 - 3.4.2 - 3.5.0 - 3.6.0 - 3.8.1
PackageVersionSupposed error messageFull log Bug report
axis2c 1.6.0-6string.c:68:24: error: comparison of unsigned expression < 0 is always false [-Werror,-Wtautological-compare] Log 753543
goplay 0.5-1.2pkgbrowser.cpp:329:11: error: comparison of unsigned expression < 0 is always false [-Werror,-Wtautological-compare] Log 753645
grail 3.1.0-2subscription.cpp:108:19: error: comparison of unsigned expression < 0 is always false [-Werror,-Wtautological-compare] Log 753646
holotz-castle 1.3.14-6../JLib/JLib/Util/JString.h:408:13: error: comparison of unsigned expression >= 0 is always true [-Werror,-Wtautological-compare] Log 754226
ion 3.2.0~dfsg1-1nm/shared/adm/adm.c:970:10: error: comparison of unsigned expression < 0 is always false [-Werror,-Wtautological-compare] Log 754319
libemu 0.2.0+git20120122-1.2environment/win32/env_w32_dll_export_ws2_32_hooks.c:372:11: error: comparison of unsigned expression < 0 is always false [-Werror,-Wtautological-compare] Log 754321
libpam-chroot 0.9-4.1pam_chroot.c:190:21: error: comparison of 0 > unsigned expression is always false [-Werror,-Wtautological-compare] Log 754322
libxs 1.2.0-1.1decoder.cpp:74:24: error: comparison of unsigned expression >= 0 is always true [-Werror,-Wtautological-compare] Log 754324
ocaml-libvirt 0.6.1.2-1./libvirt_c_epilogue.c:125:9: error: comparison of 0 <= unsigned enum expression is always true [-Werror,-Wtautological-compare] Log 754419
simulavr 0.1.2.2-6.2disp.c:463:25: error: comparison of unsigned expression >= 0 is always true [-Werror,-Wtautological-compare] Log 754591
10 errors
Return to the list