Debian Package rebuild

Rebuild of the Debian archive with clang

"Wrong C++ default declaration in a method" build failure(s)
clang 3.6.0
Return to the list
The default argument must be set in the definition or the definition done in the method declaration.
class string
{
    friend string foo(int bar = 0);
};

Versions: 2.9 - 3.0 - 3.1 - 3.2 - 3.3 - 3.4 - 3.4.2 - 3.5.0 - 3.6.0 - 3.8.1
PackageVersionSupposed error messageFull log Bug report
ball 1.4.2+20140406-1string.h:1001:24: error: friend declaration specifying a default argument must be a definition Log 755225
clamfs 1.0.1-1.1string.h:734:35: error: friend declaration specifying a default argument must be a definition Log
ddd 1:3.3.12-5strclass.h:813:19: error: friend declaration specifying a default argument must be a definition Log 755226
ghemical 3.0.0-1./project.h:210:14: error: friend declaration specifying a default argument must be a definition Log 756440
libccscript3 1.1.7-2string.h:734:35: error: friend declaration specifying a default argument must be a definition Log
libcommoncpp2 1.8.1-6../inc/cc++/string.h:734:35: error: friend declaration specifying a default argument must be a definition Log 756438
openjdk-6 6b34-1.13.6-1relocInfo.hpp:374:27: error: friend declaration specifying a default argument must be a definition Log
texmacs 1:1.0.7.18-1Kernel/Types/tree.hpp:87:15: error: friend declaration specifying a default argument must be a definition Log 756333
ui-utilcpp 1.8.3-2string.h:734:35: error: friend declaration specifying a default argument must be a definition Log
vdr-plugin-fritzbox 1.5.2-6string.h:734:35: error: friend declaration specifying a default argument must be a definition Log
vfu 4.10-1.1./vstring.h:274:19: error: friend declaration specifying a default argument must be a definition Log 756330
11 errors
Return to the list