Debian Package rebuild

Rebuild of the Debian archive with clang

"Cannot be narrowed" build failure(s)
clang 3.8.1
Return to the list

Versions: 2.9 - 3.0 - 3.1 - 3.2 - 3.3 - 3.4 - 3.4.2 - 3.5.0 - 3.6.0 - 3.8.1 - 3.9.1 - 4.0.1 - 5.0
PackageVersionSupposed error messageFull log Bug report
beignet 1.1.2-5builtin_ldexp_float.cpp:26:65: error: non-constant-expression cannot be narrowed from type 'double' to 'float' in initializer list [-Wc++11-narrowing] Log 750380
brainparty 0.61+dfsg-3BPGame.cpp:1506:25: error: non-constant-expression cannot be narrowed from type 'int' to 'GLfloat' (aka 'float') in initializer list [-Wc++11-narrowing] Log
digikam 4:5.1.0-2libraw_x3f.cpp:1249:19: error: non-constant-expression cannot be narrowed from type 'int' to 'int16_t' (aka 'short') in initializer list [-Wc++11-narrowing] Log
eris 1.3.23-4PollDefault.cpp:80:28: error: non-constant-expression cannot be narrowed from type 'unsigned long' to '__time_t' (aka 'long') in initializer list [-Wc++11-narrowing] Log
extundelete 0.2.4-1extundelete.cc:1271:28: error: non-constant-expression cannot be narrowed from type 'int' to 'ext2_ino_t' (aka 'unsigned int') in initializer list [-Wc++11-narrowing] Log
k3d 0.8.0.5-4utility_gl.h:107:22: error: non-constant-expression cannot be narrowed from type 'sample_type' (aka 'double') to 'GLfloat' (aka 'float') in initializer list [-Wc++11-narrowing] Log
kcm-fcitx 0.5.3-2skinpage.cpp:134:10: error: case value evaluates to 2401319027, which cannot be narrowed to type 'int' [-Wc++11-narrowing] Log
openjfx 8u102-b14-1../../../../src/main/native/Tools/DumpRenderTree/java/EventSender.cpp:562:75: error: non-constant-expression cannot be narrowed from type 'int' to 'JSPropertyAttributes' (aka 'unsigned int') in initializer list [-Wc++11-narrowing] Log
vdr-plugin-fritzbox 1.5.3-4notifyosd.cpp:131:23: error: non-constant-expression cannot be narrowed from type 'unsigned int' to 'int' in initializer list [-Wc++11-narrowing] Log
9 errors
Return to the list