Debian Package rebuild

Rebuild of the Debian archive with clang

"Expected declaration (#define missing?)" build failure(s)
clang 3.8.1
Return to the list

Versions: 2.9 - 3.0 - 3.1 - 3.2 - 3.3 - 3.4 - 3.4.2 - 3.5.0 - 3.6.0 - 3.8.1 - 3.9.1 - 4.0.1 - 5.0
PackageVersionSupposed error messageFull log Bug report
abgate 1.1.7-1ustring.h:256:13: error: expected ';' at end of declaration list Log
aeskulap 0.2.2b1-15ustring.h:256:13: error: expected ';' at end of declaration list Log
agave 0.4.7-2.1ustring.h:256:13: error: expected ';' at end of declaration list Log
amsynth 1.5.1-2ustring.h:256:13: error: expected ';' at end of declaration list Log
asc 2.6.1.0-1trackable.h:40:59: error: expected ';' at end of declaration list Log
astroscrappy 1.0.5-1mathcalls.h:63:1: error: expected an OpenMP directive Log
ats-lang-anairiats 0.2.11-1bool.cats:42:5: error: expected parameter declarator Log
ats2-lang 0.2.9-1./prelude/CATS/integer.cats:42:5: error: expected parameter declarator Log
buffy 1.5-2trackable.h:40:59: error: expected ';' at end of declaration list Log
cclive 0.9.3-0.1ustring.h:256:13: error: expected ';' at end of declaration list Log
chasen 2.4.5-26print.c:186:16: error: expected parameter declarator Log
couriergrey 0.3.2-5ustring.h:256:13: error: expected ';' at end of declaration list Log
crash 7.1.5-1./../include/libiberty.h:616:12: error: expected parameter declarator Log
dcap 2.47.10-1./util.h:14:12: error: expected parameter declarator Log 755964
distcc 3.1-6.2src/snprintf.h:30:5: error: expected parameter declarator Log
eiciel 0.9.11-2ustring.h:256:13: error: expected ';' at end of declaration list Log
fakechroot 2.18-1.1./libfakechroot.h:218:5: error: expected parameter declarator Log
flowcanvas 0.7.1+dfsg0-0.4ustring.h:256:13: error: expected ';' at end of declaration list Log
fribidi 0.19.7-1fribidi-char-sets-cap-rtl.c:109:6: error: expected expression Log
gbgoffice 1.4-10ustring.h:256:13: error: expected ';' at end of declaration list Log
gconfmm2.6 2.28.0-2ustring.h:256:13: error: expected ';' at end of declaration list Log
gdal 2.1.1+dfsg-1cpl_port.h:858:5: error: expected parameter declarator Log
gelemental 1.2.0-10ustring.h:256:13: error: expected ';' at end of declaration list Log
gigedit 0.2.0-1trackable.h:40:59: error: expected ';' at end of declaration list Log
gip 1.7.0-1-4ustring.h:256:13: error: expected ';' at end of declaration list Log
gmchess 0.29.6-2ustring.h:256:13: error: expected ';' at end of declaration list Log
gmlive 0.22.3-1ustring.h:256:13: error: expected ';' at end of declaration list Log
gobby 0.5.0-8ustring.h:256:13: error: expected ';' at end of declaration list Log
gr-iqbal 0.37.2-7cxvec.h:45:15: error: expected ';' at end of declaration list Log
gsmartcontrol 0.8.7-1.1ustring.h:256:13: error: expected ';' at end of declaration list Log
gstreamermm-1.0 1.4.3+dfsg-5ustring.h:256:13: error: expected ';' at end of declaration list Log
gtkdataboxmm 0.9.4-3ustring.h:256:13: error: expected ';' at end of declaration list Log
gtkglextmm 1.2.0-7ustring.h:256:13: error: expected ';' at end of declaration list Log
gtkguitune 0.8-6ustring.h:256:13: error: expected ';' at end of declaration list Log
gtkmm2.4 1:2.24.4-2ustring.h:256:13: error: expected ';' at end of declaration list Log
gtkspellmm 3.0.4+dfsg-1ustring.h:256:13: error: expected ';' at end of declaration list Log
hexxagon 1.0pl1-3.1ustring.h:256:13: error: expected ';' at end of declaration list Log
icinga 1.13.3-3./../include/snprintf.h:29:5: error: expected parameter declarator Log
jd 1:2.8.9-150226-5ustring.h:256:13: error: expected ';' at end of declaration list Log
jstest-gtk 0.1.1~git20140501-2ustring.h:256:13: error: expected ';' at end of declaration list Log
julia 0.4.6-1init.c:608:12: error: expected parameter declarator Log
ladish 1+dfsg0-5ustring.h:256:13: error: expected ';' at end of declaration list Log
libesmtp 1.0.6-4./missing.h:48:5: error: expected parameter declarator Log
libglademm2.4 2.6.7-5ustring.h:256:13: error: expected ';' at end of declaration list Log
libgnomecanvasmm2.6 2.26.0-2ustring.h:256:13: error: expected ';' at end of declaration list Log
libofx 1:0.9.10-1ustring.h:256:13: error: expected ';' at end of declaration list Log
libview 0.6.6-2.1ustring.h:256:13: error: expected ';' at end of declaration list Log
libwfut 0.2.3-4trackable.h:40:59: error: expected ';' at end of declaration list Log
libwnckmm 0.1.1-2ustring.h:256:13: error: expected ';' at end of declaration list Log
ll-scope 0.2.1-3ustring.h:256:13: error: expected ';' at end of declaration list Log
mandelbulber2 2.08.3-1mathcalls.h:63:1: error: expected an OpenMP directive Log
mangler 1.2.5-4ustring.h:256:13: error: expected ';' at end of declaration list Log
mawk 1.3.3-17print.c:85:11: error: expected parameter declarator Log
mcelog 140+dfsg-1memutil.c:66:5: error: expected parameter declarator Log
modglue 1.17-2.4trackable.h:40:59: error: expected ';' at end of declaration list Log
mtools 4.0.18-2mainloop.c:89:15: error: expected ')' Log
nitrogen 1.5.2-2ustring.h:256:13: error: expected ';' at end of declaration list Log
openhpi 3.6.1-2session.cpp:121:17: error: expected expression Log
paman 0.9.4-1ustring.h:256:13: error: expected ';' at end of declaration list Log
paprefs 0.9.10-2ustring.h:256:13: error: expected ';' at end of declaration list Log
pavucontrol 3.0-3ustring.h:256:13: error: expected ';' at end of declaration list Log
pavumeter 0.9.3-4ustring.h:256:13: error: expected ';' at end of declaration list Log
pchar 1.5-3./pc.h:28:15: error: expected identifier Log
pdfchain 1:0.4.4-1ustring.h:256:13: error: expected ';' at end of declaration list Log
pink-pony 1.4.1-2trackable.h:40:59: error: expected ';' at end of declaration list Log
python-visual 1:5.12-1.6ustring.h:256:13: error: expected ';' at end of declaration list Log
referencer 1.2.2-1ustring.h:256:13: error: expected ';' at end of declaration list Log
regexxer 0.10-2ustring.h:256:13: error: expected ';' at end of declaration list Log
sdpa 7.3.9+dfsg-1mexFprintf.c:32:5: error: expected parameter declarator Log
snap-aligner 0.18~1.0~beta.18+dfsg1-4SNAPLib/AlignerContext.cpp:341:34: error: expected ')' Log
synfig 1.0.2-1trackable.h:40:59: error: expected ';' at end of declaration list Log
synfigstudio 1.0.2-1trackable.h:40:59: error: expected ';' at end of declaration list Log
tmispell-voikko 0.7.1-4ustring.h:256:13: error: expected ';' at end of declaration list Log
urjtag 0.10+r2007-1.2../../include/libiberty.h:589:12: error: expected parameter declarator Log
visualboyadvance 1.8.0.dfsg-4debugger.cpp:1725:36: error: expected ')' Log
vocproc 0.2-5ustring.h:256:13: error: expected ';' at end of declaration list Log
76 errors
Return to the list