Debian Package rebuild

Rebuild of the Debian archive with clang

"non-void function should return a value" build failure(s)
clang 3.8.1
Return to the list
With the command
clang -c -Werror plop.c
the code
int myFunction() {
	return;
}
is rejected by clang while accepted with gcc.
Versions: 2.9 - 3.0 - 3.1 - 3.2 - 3.3 - 3.4 - 3.4.2 - 3.5.0 - 3.6.0 - 3.8.1 - 3.9.1 - 4.0.1 - 5.0
PackageVersionSupposed error messageFull log Bug report
autolog 0.40-13.1autolog.c:358:2: error: non-void function 'save_users' should return a value [-Wreturn-type] Log 740031
bluemon 1.4-6.1bluetooth-monitor.c:299:10: error: non-void function 'get_link_qual' should return a value [-Wreturn-type] Log 740036
calculix-ccx 2.11-1u_free.c:44:3: error: non-void function 'u_free' should return a value [-Wreturn-type] Log
cattle-1.0 1.2.0-1cattle-buffer.c:241:2: error: non-void function 'cattle_buffer_get_value' should return a value [-Wreturn-type] Log
dvi2ps 5.1j-1.2virfont.c:320:2: error: non-void function 'vf_mc' should return a value [-Wreturn-type] Log 760387
dynalogin 1.0.0-3dynalogind.c:79:3: error: non-void function 'read_line' should return a value [-Wreturn-type] Log 743004
eigensoft 6.1.3+dfsg-1gds.c:412:5: error: non-void function 'ewens' should return a value [-Wreturn-type] Log
evolution-rss 0.3.95-5rss.c:4359:2: error: non-void function 'process_attachments' should return a value [-Wreturn-type] Log
ferret-vis 7.0-1grab_image_xwd.c:309:2: error: non-void function 'Window_Dump' should return a value [-Wreturn-type] Log
gamin 0.1.10-5gam_eq.c:127:3: error: non-void function 'gam_eq_flush' should return a value [-Wreturn-type] Log 743699
gbatnav 1.0.4cvs20051004-5play.c:509:3: error: non-void function 'lookup_funcion' should return a value [-Wreturn-type] Log 743696
geki2 2.0.3-9ranking.c:18:5: error: non-void function 'ScoreRanking' should return a value [-Wreturn-type] Log
gfpoken 1-2main.c:681:3: error: non-void function 'leveldraw_drag_end' should return a value [-Wreturn-type] Log
gnome-boxes 3.20.2-2installer-media.c:522:3: error: non-void function 'boxes_installer_media_construct_for_path_finish' should return a value [-Wreturn-type] Log
gramophone2 0.8.13a-3midifile.c:159:3: error: non-void function 'readheader' should return a value [-Wreturn-type] Log 760662
graywolf 0.1.3-1buster.c:230:2: error: non-void function 'Ybuster_addpt' should return a value [-Wreturn-type] Log
grcm 0.1.6-1callbacks.c:134:4: error: non-void function 'on_ConnectionsWindow_delete_event' should return a value [-Wreturn-type] Log 760664
gtimer 2.0.0-1.2custom-list.c:613:3: error: non-void function 'custom_list_append_record' should return a value [-Wreturn-type] Log 743313
hpsockd 0.17v5.c:162:3: error: non-void function 'v5Request' should return a value [-Wreturn-type] Log
ibus-array 0.1.0-1engine.c:324:9: error: non-void function 'ibus_array_engine_update_symbol_lookup_table' should return a value [-Wreturn-type] Log 743130
irssi-plugin-robustirc 0.5-1robustsession-network.c:268:9: error: non-void function 'robustsession_network_server' should return a value [-Wreturn-type] Log
kannel-sqlbox 0.7.2-4sqlbox_mssql.c:109:9: error: non-void function 'mssql_fetch_msg' should return a value [-Wreturn-type] Log 742733
kprinter4 12-1postscriptdocument.h:100:120: error: control may reach end of non-void function [-Werror,-Wreturn-type] Log
latencytop 0.5fsync.c:66:4: error: non-void function 'chain_file' should return a value [-Wreturn-type] Log 760285
ldapvi 1.7-10ldapvi.c:1468:30: error: non-void function 'copy_sasl_output' should return a value [-Wreturn-type] Log 760286
libace-perl 1.92-4RPC.xs:157:6: error: non-void function 'constant' should return a value [-Wreturn-type] Log
libgraphics-libplot-perl 2.2.2-6Libplot.xs:91:6: error: non-void function 'constant' should return a value [-Wreturn-type] Log
librsl 1.43-1kwaj_subtract_one_day.c:40:3: error: non-void function 'subtract_one_day' should return a value [-Wreturn-type] Log 742219
libwww-curl-perl 4.17-2./curlopt-constants.c:19:58: error: non-void function 'constant' should return a value [-Wreturn-type] Log
lightdm-gtk-greeter 2.0.1-2greeterbackground.c:465:5: error: non-void function 'greeter_background_get_configured_monitors' should return a value [-Wreturn-type] Log
loqui 0.6.4-1remark_entry.c:553:2: error: non-void function 'remark_entry_find_completion_matches' should return a value [-Wreturn-type] Log
lwipv6 1.5a-2../../../../ports/unix/netif/vdeif.c:485:3: error: non-void function 'vdeif_streampkt_input' should return a value [-Wreturn-type] Log
lxterminal 0.2.0-1setting.c:165:5: error: non-void function 'copy_setting' should return a value [-Wreturn-type] Log
mate-panel 1.14.2-1panel-toplevel.c:3342:3: error: non-void function 'set_background_region' should return a value [-Wreturn-type] Log
moria 5.6.debian.1-2signals.c:139:7: error: non-void function 'signal_handler' should return a value [-Wreturn-type] Log
nield 0.6.1-2tcmsg_filter_flow.c:310:5: error: non-void function 'conv_flow_key' should return a value [-Wreturn-type] Log
notebook 0.2rel-3ui/nb_ui_interface_callbacks.c:80:3: error: non-void function 'nb_ui_cb_on_quit_clicked' should return a value [-Wreturn-type] Log
notify-osd 0.9.35+15.04.20150126-1./display.c:291:2: error: non-void function 'stack_layout' should return a value [-Wreturn-type] Log
nufw 2.4.3-3.3sasl.c:368:7: error: non-void function 'get_proto_info' should return a value [-Wreturn-type] Log 741863
openmama 2.2.2.1-11mamajni.c:930:20: error: non-void function 'Java_com_wombat_mama_Mama_getProperty' should return a value [-Wreturn-type] Log
python-srp 1.0.4-1.1srp/_srp.c:1506:9: error: non-void function 'init_srp' should return a value [-Wreturn-type] Log
ratfor 1.0-15rat4.c:367:3: error: non-void function 'balpar' should return a value [-Wreturn-type] Log 812169
savi 1.4.9-1coverage_vis.c:626:3: error: non-void function 'coverage_dynamic_initialised' should return a value [-Wreturn-type] Log
scottfree 1.14-9ScottCurses.c:1167:7: error: non-void function 'PerformActions' should return a value [-Wreturn-type] Log 760675
sdl-mixer1.2 1.2.12-11music_mad.c:227:2: error: non-void function 'mad_getSamples' should return a value [-Wreturn-type] Log 741373
skyeye 1.2.5-5common/armsupp.c:696:3: error: non-void function 'ARMul_MRC' should return a value [-Wreturn-type] Log 812168
socks4-server 4.3.beta2-19Rconnect.c:124:3: error: non-void function 'SOCKSinit' should return a value [-Wreturn-type] Log
tcpspy 1.7d-12tcpspy.c:721:7: error: non-void function 'main' should return a value [-Wreturn-type] Log
thunar-volman 0.8.1-2tvm-block-device.c:717:3: error: non-void function 'tvm_block_device_mount' should return a value [-Wreturn-type] Log
uniutils 2.27-2unifuzz.c:109:44: error: non-void function 'EmitAllRanges' should return a value [-Wreturn-type] Log 740968
xfce4-pulseaudio-plugin 0.2.4-1pulseaudio-plugin.c:269:3: error: non-void function 'pulseaudio_plugin_bind_keys' should return a value [-Wreturn-type] Log
xgks 2.6.1+dfsg.2-4input.c:209:2: error: non-void function 'XgksIProcessXEvent' should return a value [-Wreturn-type] Log 740871
xpilot-ng 1:4.7.3-2.2suibotdef.c:408:5: error: non-void function 'Get_object_proximity' should return a value [-Wreturn-type] Log 740671
z88dk 1.8.ds1-10cpp2.c:339:9: error: non-void function 'doif' should return a value [-Wreturn-type] Log 812152
54 errors
Return to the list