Debian Package rebuild

Rebuild of the Debian archive with clang

"Linker error" build failure(s)
clang 3.8.1
Return to the list

Versions: 2.9 - 3.0 - 3.1 - 3.2 - 3.3 - 3.4 - 3.4.2 - 3.5.0 - 3.6.0 - 3.8.1
PackageVersionSupposed error messageFull log Bug report
bash 4.3-15clang: error: linker command failed with exit code 1 (use -v to see invocation) Log
batctl 2016.2-1clang: error: linker command failed with exit code 1 (use -v to see invocation) Log
batmand 0.3.2-17clang: error: linker command failed with exit code 1 (use -v to see invocation) Log
blobwars 2.00-1clang: error: linker command failed with exit code 1 (use -v to see invocation) Log 753844
ecdsautils 0.3.2+git20151018-2 clang: error: linker command failed with exit code 1 (use -v to see Log
fastd 18-2clang: error: linker command failed with exit code 1 (use -v to see invocation) Log
python2.7 2.7.12-2clang: error: linker command failed with exit code 1 (use -v to see invocation) Log
python3.5 3.5.2-3clang: error: linker command failed with exit code 1 (use -v to see invocation) Log
qbs 1.5.2+dfsg-1clang: error: linker command failed with exit code 1 (use -v to see invocation) Log
scrm 1.7.2-1clang: error: linker command failed with exit code 1 (use -v to see invocation) Log
stockfish 7-0.1clang: error: linker command failed with exit code 1 (use -v to see invocation) Log
tvoe 0.1-1clang: error: linker command failed with exit code 1 (use -v to see invocation) Log
12 errors
Return to the list