Debian Package rebuild

Rebuild of the Debian archive with clang

"Not categorized" build failure(s)
clang 3.8.1
Return to the list

Versions: 2.9 - 3.0 - 3.1 - 3.2 - 3.3 - 3.4 - 3.4.2 - 3.5.0 - 3.6.0 - 3.8.1 - 3.9.1 - 4.0.1 - 5.0
PackageVersionSupposed error messageFull log Bug report
0ad 0.0.20-2../../build/unix/gold/ld: error: hidden symbol 'ceil' is not defined locally Log
389-dsgw 1.1.11-2../edit.c:30:5: error: third parameter of 'main' (environment) must be of type 'char **' Log
9base 1:6-7n1.c:124:5: error: unterminated function-like macro invocation Log
abcm2ps 7.8.9-1dh_auto_test: make -j1 test VERBOSE=1 returned exit code 2 Log
acpid 1:2.0.26-1configure: error: "asprintf() not found" Log
adabrowse 4.0.3-7Undetected errorLog
adacontrol 1.17r3.1-4Undetected errorLog
agg 2.5+dfsg1-10../include/agg_renderer_outline_aa.h:1378:45: error: binding value of type 'const agg::line_profile_aa' to reference to type 'agg::line_profile_aa' drops 'const' qualifier Log
alljoyn-core-1509 15.09a-4alljoyn_c/src/PermissionConfigurationListener.cc:33:17: error: using directive refers to implicitly-defined namespace 'std' [-Werror] Log
alljoyn-core-1604 16.04-4alljoyn_c/src/PermissionConfigurationListener.cc:32:17: error: using directive refers to implicitly-defined namespace 'std' [-Werror] Log
android-platform-build 1:6.0.1+r55-1~stage1make[1]: pandoc: Command not found Log
android-platform-libnativehelper 6.0.1+r55-1ld: final link failed: Bad value Log
apbs 1.4-1Undetected errorLog
appindicator3-sharp 12.10.0+git20151221-3Undetected errorLog
aptitude 0.8.3-1../../../../src/generic/problemresolver/problemresolver.h:1724:17: error: use of non-static data member 'graph' of 'generic_problem_resolver' from nested type 'do_process_promotion' Log
arj 3.10.22-15 Log
asis 2015-1Undetected errorLog
aspell 0.60.7~20110707-3./common/errors.hpp:17:36: error: redeclaration of 'aerror_other' with a different type: 'const acommon::ErrorInfo *const' vs 'const struct AspellErrorInfo *const' Log
asterisk 1:13.9.1~dfsg-2Dependencies installation failed Log
asterisk-espeak 3.0-2utils.h:1034:15: error: blocks support disabled - compile with -fblocks or pick a deployment target that supports them Log
asterisk-flite 2.2-1utils.h:1034:15: error: blocks support disabled - compile with -fblocks or pick a deployment target that supports them Log
atlas 3.10.3-1Undetected errorLog
autodocksuite 4.2.6-3configure: error: in `/<>/autodock' Log
avifile 1:0.7.48~20090503.ds-19common/avm_output.cpp:20:12: error: qualified reference to 'AvmOutput' is a constructor name rather than a type wherever a constructor can be declared Log
bagel 0.0~git20160507-3configure: error: in `/<>' Log
banshee 2.6.2-6Undetected errorLog
bareftp 0.3.9-3./AssemblyInfo.cs(5,12): error CS0647: Error during emitting `System.Reflection.AssemblyVersionAttribute' attribute. The reason is `Could not find file "/etc/localtime"' Log
bcron 0.10-3Undetected errorLog
binutils 2.27-6Undetected errorLog
blobandconquer 1.11-dfsg+20-1dpkg-buildpackage: error: debian/rules build-arch gave error exit status 2 Log
bmusb 0.5.1-1bmusb.cpp:557:16: error: 'target' attribute takes one argument Log
boinc 7.6.33+dfsg-1configure: error: in `/<>/boinc-7.6.33+dfsg' Log
brotli 0.4.0+dfsg-1Undetected errorLog
bup 0.27.1-1Tests failures Log
cernlib 20061220+dfsg3-4.2Undetected errorLog
cgal 4.8.1-1Undetected errorLog
chealpix 3.30.0-2configure: error: in `/<>' Log
chise-base 0.3.0-2dpkg-buildpackage: error: debian/rules build-arch gave error exit status 2 Log
cigi-ccl 3.3.3a+svn818-10dh_install: missing files, aborting Log
cinnamon-control-center 3.0.1-1Undetected errorLog
clblas 2.10-3dgemm_Col_NN_B0_MX048_NX048_KX08_src.cpp:21:2: error: embedding a #pragma directive within macro arguments is not supported Log
cld2 0.0.0-git20150806-5Undetected errorLog
clisp 1:2.49-10dpkg-buildpackage: error: debian/rules build-arch gave error exit status 2 Log
cmocka 1.0.1-2Dependencies installation failed Log
coinor-flopc++ 1.0.6-3.1./MP_domain.hpp:180:18: error: return type of virtual function 'getSet' is not covariant with the return type of the function it overrides ('flopc::MP_set_base' is incomplete) Log
comedilib 0.10.2-4clang: error: clang frontend command failed with exit code 70 (use -v to see invocation) Log
comgt 0.32-2dpkg-buildpackage: error: debian/rules build-arch gave error exit status 2 Log
cook 2.33-2dpkg-buildpackage: error: debian/rules build-arch gave error exit status 2 Log
courier-authlib 0.66.4-7configure: error: --with-mailuser. Log
cpluff 0.1.4+dfsg1-1cpluff.c:84:35: error: too many arguments provided to function-like macro invocation Log
csmash 0.6.6-6.7dpkg-buildpackage: error: debian/rules build-arch gave error exit status 2 Log
csound 1:6.07.0~dfsg-2/bin/sh: 1: licensecheck: not found Log
cssc 1.4.0-5Tests failures Log
csync2 2.0-8-g175a01c-2configure: error: mysql header not found; install mysql-devel and dependencies for MySQL Support Log
dacs 1.4.28b-3Undetected errorLog
daemontools 1:0.76-6dpkg-buildpackage: error: debian/rules build-arch gave error exit status 2 Log
dateutils 0.3.1-1.1Tests failures Log
davix 0.6.4-1Tests failures Log
dbuskit 0.1.1-2configure: error: "could not find runtime.h. DBusKit requires gnustep-base >=1.20." Log
dh-ada-library 6.8Undetected errorLog
dicom3tools 1.00~20160721064406-1./Imakefile:177:3: error: invalid preprocessing directive Log
djbdns 1:1.05-8dpkg-buildpackage: error: debian/rules build-arch gave error exit status 2 Log
doxymacs 1.8.0-6.1clang: error: optimization flag '-fexpensive-optimizations' is not supported Log
dx 1:4.4.4-9edfio.c:329:14: error: static declaration of 'mkfifo' follows non-static declaration Log 743003
eclib 20160720-1dh_auto_test: make -j1 check VERBOSE=1 returned exit code 2 Log 755227
ekg2 1:0.4~pre+20120506.1-12Makefile.am:144: error: 'plugins/autoresponder/autoresponder.la' is not a standard libtool library name Log
elfutils 0.166-2configure: error: gcc with GNU99 support required Log 758064
elk 3.99.8-4dh_auto_test: make -j1 check VERBOSE=1 returned exit code 2 Log
emacs24 24.5+1-6configure: error: Gtk+ wanted, but it does not compile, see config.log. Maybe some x11-devel files missing? Log
encfs 1.8.1-3configure: error: in `/<>' Log
ergo 3.4.0-2configure: error: in `/<>' Log
esperanza 0.4.0+git20091017-4coll.h:615:6: error: binding value of type 'const Xmms::Coll::Coll' to reference to type 'Xmms::Coll::Coll' drops 'const' qualifier Log
esys-particle 2.3.4+dfsg1-2./SphAggGougeBlock.hpp:39:37: error: no viable conversion from '__normal_iterator' to '__normal_iterator' Log
exactimage 0.9.1-16agg_renderer_outline_aa.h:1378:45: error: binding value of type 'const agg::line_profile_aa' to reference to type 'agg::line_profile_aa' drops 'const' qualifier Log
faumachine 20160511-1./../arch_x86/arch_gen_cpu_x86_state.h:815:30: error: register 'rbx' unsuitable for global register variables on this target Log
fcml 1.1.1-2dh_auto_test: make -j1 check VERBOSE=1 returned exit code 2 Log
firefox 48.0-1ld: final link failed: Bad value Log
fis-gtm 6.3-000-2g_msf.si:21:12: error: unknown token in expression Log
frame 2.5.0-3x11/device_x11.cpp:126:13: error: moving a temporary object prevents copy elision [-Werror,-Wpessimizing-move] Log
freebirth 0.3.2-9.1dpkg-buildpackage: error: debian/rules build-arch gave error exit status 2 Log
freetype 2.6.3-3ftcommon.c:1111:29: error: shifting a negative signed value is undefined [-Werror,-Wshift-negative-value] Log
fsgateway 0.1.1-5AssemblyInfo.cs(38,12): error CS0647: Error during emitting `System.Reflection.AssemblyVersionAttribute' attribute. The reason is `Could not find file "/etc/localtime"' Log
ftgl 2.1.3~rc5-4+nmu1dpkg-buildpackage: error: debian/rules build-arch gave error exit status 2 Log
fvwm 1:2.6.5.ds-4.1configure: error: " Log
gauche-c-wrapper 0.6.1-7dh_auto_test: make -j1 check VERBOSE=1 returned exit code 2 Log
gbsplay 0.0.93-1Undetected errorLog
gcc-6 6.2.0-1configure: error: GNAT is required to build ada Log
gdb 7.11.1-2Undetected errorLog
gdb-arm-none-eabi 9Undetected errorLog
geant321 1:3.21.14.dfsg-11Undetected errorLog
getfem++ 5.1+dfsg1-2configure: error: g++ do not support option -std=c++11. Update g++ to at least release 4.8.1. Log
gforth 0.7.3+dfsg-3Undetected errorLog
gle 3.1.0-7.1dpkg-buildpackage: error: debian/rules build-arch gave error exit status 2 Log
glib2.0 2.48.1-3Undetected errorLog
glibmm2.4 2.48.1-1Undetected errorLog
gltron 0.70final-12.1configure: error: OpenGL is not installed Log
gnash 0.8.11~git20160608-1.1agg_scanline_u.h:476:30: error: type 'base_type' (aka 'agg::scanline_u8') is not a direct or virtual base of 'scanline32_u8_am' Log
gnat-gps 6.1.1-1Undetected errorLog
gnat-mingw-w64 19.1Undetected errorLog
gnokii 0.6.30+dfsg-1.1dpkg-buildpackage: error: debian/rules build-arch gave error exit status 2 Log 757494
gnome-control-center 1:3.20.1-2Undetected errorLog
gnome-do 0.95.3-5./AssemblyInfo.cs(36,12): error CS0647: Error during emitting `System.Reflection.AssemblyVersionAttribute' attribute. The reason is `Could not find file "/etc/localtime"' Log
gnome-keyring-sharp 1.0.0-5Undetected errorLog
gnome-pie 0.6.8-2Dependencies installation failed Log
gnome-python 2.28.1+dfsg-1.1dpkg-buildpackage: error: debian/rules build-arch gave error exit status 2 Log
gnucap 1:0.36~20091207-2./mg_.h:134:19: error: variable has incomplete type 'C_Comment' Log
gnucash 1:2.6.13-1Tests failures Log
gnustep-base 1.24.9-3configure: error: Could not find Objective-C headers Log
golang 2:1.6.1-2Undetected errorLog
golang-1.6 1.6.3-1Undetected errorLog
golang-1.7 1.7-3Undetected errorLog
google-perftools 2.2.1-0.3Undetected errorLog
gpg-remailer 3.02.00-1mail/../cleartextmail/../mailer/send.f:11:17: error: cannot cast 'Mailer' to its private base class 'MailerBase' Log
gprolog 1.3.0-6.1Undetected errorLog
gqrx-sdr 2.5.3-4clang: error: unable to execute command: Killed Log
gr-rds 3.7.0.2.a542331-1clang: error: unable to execute command: Killed Log
grml2usb 0.14.13mbr.S:38:16: error: unexpected token in argument list Log
grub 0.97-71configure: error: GRUB requires GAS .code16 addr32 support; upgrade your binutils Log
gsequencer 0.6.55-1src/ags/audio/ags_audio.c:816:3: error: illegal storage class on function Log
gtk-sharp2 2.12.10-6Undetected errorLog
gtk-sharp3 2.99.3-2Undetected errorLog
guymager 0.7.4-2aewf.cpp:141:12: error: field has incomplete type 'uint []' Log
hardening-wrapper 2.8+nmu2dh_auto_test: make -j1 check returned exit code 2 Log
haskell-aeson-compat 0.3.5.1-1Dependencies installation failed Log
haskell-aeson-extra 0.3.2.0-1Dependencies installation failed Log
haskell-attoparsec 0.13.0.2-1Dependencies installation failed Log
haskell-binary-orphans 0.1.5.1-1Dependencies installation failed Log
haskell-binary-tagged 0.1.4.0-1Dependencies installation failed Log
haskell-crypto-numbers 0.2.7-5Dependencies installation failed Log
haskell-cryptohash 0.11.9-1Dependencies installation failed Log
haskell-cryptonite 0.19-1Dependencies installation failed Log
haskell-hit 0.6.3-5Dependencies installation failed Log
haskell-hledger 0.27-1Dependencies installation failed Log
haskell-hledger-interest 1.4.4-4Dependencies installation failed Log
haskell-hledger-lib 0.27-1Dependencies installation failed Log
haskell-hopenpgp 2.5.1-1Dependencies installation failed Log
haskell-hourglass 0.2.10-1Dependencies installation failed Log
haskell-jwt 0.7.2-1Dependencies installation failed Log
haskell-lens 4.13-1Undetected errorLog
haskell-memory 0.13-1Dependencies installation failed Log
haskell-monad-loops 0.4.3-3Dependencies installation failed Log
haskell-persistent-postgresql 2.2.2-1Dependencies installation failed Log
haskell-regex-applicative 0.3.3-1Dependencies installation failed Log
haskell-sandi 0.3.6-1Dependencies installation failed Log
haskell-tasty-golden 2.3.1.1-1Dependencies installation failed Log
haskell-tasty-hspec 1.1.3-1Dependencies installation failed Log
haskell-these 0.6.2.1-1Dependencies installation failed Log
haskell-time-parsers 0.1.0.0-2Dependencies installation failed Log
haskell-tls 1.3.8-1Dependencies installation failed Log
haskell-uuid 1.3.12-1Dependencies installation failed Log
haskell-uuid-types 1.0.3-1Dependencies installation failed Log
haskell-werewolf 1.0.2.2-1Dependencies installation failed Log
haskell-x509 1.6.3-1Dependencies installation failed Log
healpix-cxx 3.30.0-2configure: error: in `/<>' Log
hilive 0.0+20150926-1definitions.h:74:38: error: non-type template argument is not a constant expression Log
hugs98 98.200609.21-5.4tools/make_bootlib: 68: tools/make_bootlib: -D__HUGS__: not found Log
hylafax 3:6.0.6-6Undetected errorLog
hyphy 2.2.6+dfsg-5calcnode2.cpp:600:29: error: restrict requires a pointer or reference ('_Parameter' (aka 'double') is invalid) Log
icedtea-web 1.6.2-3dpkg-buildpackage: error: debian/rules build-arch gave error exit status 2 Log
idjc 0.8.16-1configure: error: math library is missing critical function Log
igraph 0.7.1-2.1dh_auto_test: make -j1 check VERBOSE=1 returned exit code 2 Log
ikvm 8.1.5717.0+ds-1Undetected errorLog
imvirt 0.9.6-3vmware.c:65:5: error: invalid operand for instruction Log
injeqt 1.0.1-1provider-by-default-constructor.h:79:16: error: 'required_types' overrides a member function but is not marked 'override' [-Werror,-Winconsistent-missing-override] Log
intel-vaapi-driver 1.7.1-1Undetected errorLog
interchange 5.7.7-2dpkg-buildpackage: error: debian/rules build-arch gave error exit status 2 Log
isc-kea 1.0.0-4configure: error: Needs MySQL library Log
jackd2 1.9.10+20150825git1ed50c92~dfsg-2/bin/sh: 1: licensecheck: not found Log 757820
kdenetwork-filesharing 4:16.04.2-1daemon.h:291:17: error: calling a private constructor of class 'QString' Log
kdeplasma-addons 4:5.6.5-1Dependencies installation failed Log
khotkeys 4:5.7.0-1Dependencies installation failed Log
kimwitu++ 2.3.13-2dpkg-buildpackage: error: debian/rules build-arch gave error exit status 2 Log
klog 0.9.2.3-1.1dh_install: missing files, aborting Log
kmag 4:16.08.0-1accessibleobject.h:718:38: error: no function named 'operator<<' with type 'QDebug (QDebug, const QAccessibleClient::AccessibleObject &)' was found in the specified scope Log
kover 1:4-9Undetected errorLog
kphotoalbum 4.7.2-2Util.cpp:127:62: error: invalid suffix 'd' on floating constant Log
lepton 1.2.1-2Tests failures Log
lhasa 0.3.1-1Tests failures Log
libalog 0.5.2-1Tests failures Log
libaunit 3.7.2-1Undetected errorLog
libaws 3.3.2-2Undetected errorLog
libclass-date-perl 1.1.15-1Tests failures Log
libdbi-drivers 0.9.0-4Undetected errorLog
libfiu 0.94-7Tests failures Log
libflorist 2016-1Undetected errorLog
libgd2 2.2.3-3tiff/tiff_dpi.c:84:7: error: no newline at end of file [-Werror,-Wnewline-eof] Log
libgnatcoll 1.7gpl2015-2Undetected errorLog
libgpiv 0.6.1-4.3configure: error: "libgomp not installed" Log
libgpod 0.8.3-8../../../../../bindings/mono/libgpod-sharp-test/AssemblyInfo.cs(20,12): error CS0647: Error during emitting `System.Reflection.AssemblyVersionAttribute' attribute. The reason is `Could not find file "/etc/localtime"' Log
libgtkada 3.8.3-1configure: error: /usr/bin/gprbuild test failed at compile time! Check your configuration. Log
libgweather 3.20.2-1configure: error: Can't find zoneinfo directory. Use --with-zoneinfo-dir Log
libindi 1.2.0-2~mathcalls.h:319:14: error: exception specification in declaration does not match previous declaration Log
liblog4ada 1.3-1Undetected errorLog
liblunar 2.0.1-2.3dpkg-buildpackage: error: debian/rules build-arch gave error exit status 2 Log
libncursesada 6.0.20150808-1configure: error: No usable Ada compiler found Log
libomxalsa 0.1-2configure: error: POSIX threads support is required Log
libomxcamera 0.1-2configure: error: in `/<>' Log
libomxfbdevsink 0.1-2configure: error: in `/<>' Log
libomxil-bellagio 0.9.3-3configure: error: libdl is required Log
libomxmad 0.1-1configure: error: POSIX threads support is required Log
libomxvideosrc 0.1-1configure: error: in `/<>' Log
libomxvorbis 0.1-3configure: error: in `/<>' Log
libomxxvideo 0.1-3configure: error: POSIX threads support is required Log
libopengl-perl 0.6704+dfsg-2Tests failures Log
libqaccessibilityclient 0.1.1-5accessibleobject.h:718:38: error: no function named 'operator<<' with type 'QDebug (QDebug, const QAccessibleClient::AccessibleObject &)' was found in the specified scope Log
librasterlite2 1.0.0~rc0+devel1-3configure: error: 'libgeotiff' is required but the header (geotiff.h) doesn't seem to be installed on this system Log
libs3 2.0-2inc/request.h:131:14: error: sizeof on pointer operation will return size of 'char *' instead of 'char [9]' [-Werror,-Wsizeof-array-decay] Log
libshevek 1.4-1ustring.h:102:29: error: alias declarations are a C++11 extension [-Werror,-Wc++11-extensions] Log 754323
libsyncml 0.5.4-2.3dpkg-buildpackage: error: debian/rules build-arch gave error exit status 2 Log
libtemplates-parser 11.10-4Undetected errorLog
libtexttools 2.1.0-8Undetected errorLog
libtomcrypt 1.17-7./src/headers/tomcrypt_macros.h:269:24: error: constraint 'I' expects an integer constant expression Log
libvirt 2.1.0-2Tests failures Log
libvisio 0.1.5-1Tests failures Log
libvoikko 4.0.2-2morphology/Analysis.cpp:37:2: error: suggest braces around initialization of subobject [-Werror,-Wmissing-braces] Log
libwx-perl 1:0.9928-1Undetected errorLog
libwx-scintilla-perl 0.39-3Undetected errorLog
libxmlezout 1.06.1-8Undetected errorLog
lierolibre 0.5-2src/gvl/io/encoding.hpp:586:19: error: cast from pointer to smaller type 'uint32_t' (aka 'unsigned int') loses information Log
lightspark 0.7.2+git20150512-2.1Undetected errorLog
lilv 0.22.0~dfsg0-1Undetected errorLog
linux-wlan-ng 0.2.9+dfsg-5dpkg-buildpackage: error: debian/rules build-arch gave error exit status 2 Log
linux86 0.16.17-3.1dpkg-buildpackage: error: debian/rules build-arch gave error exit status 2 Log
lookup 1.08b-11lib/romaji2kana.c:59:12: error: source file is not valid UTF-8 Log
lordsawar 0.3.0-3 Log
m4 1.4.17-5dh_auto_test: make -j1 check VERBOSE=1 returned exit code 2 Log
mame 0.176-3/bin/sh: 1: clang++: not found Log
mandelbulber 1:1.21.1-1.1../src/Render3D.cpp:1412:25: error: non-aggregate type 'CVector3' cannot be initialized with an initializer list Log
maria 1.3.5-4dpkg-buildpackage: error: debian/rules build-arch gave error exit status 2 Log
marisa 0.2.4-8dh_auto_test: make -j1 check VERBOSE=1 returned exit code 2 Log
maude 2.7-2dh_auto_test: make -j1 check VERBOSE=1 returned exit code 2 Log
mbt 3.2.16-1 Log
mclibs 20061220+dfsg3-3Undetected errorLog
mediatomb 0.12.1-47-g7ab7616-1configure: error: unable to configure mysql support Log
memtest86 4.3.7-3main.c:229:2: error: indirect goto in function with no address-of-label expressions Log
memtest86+ 5.01-3main.c:223:2: error: indirect goto in function with no address-of-label expressions Log
mesa 11.2.2-1clang: error: clang frontend command failed with exit code 70 (use -v to see invocation) Log
metview 4.6.7-1Divrot.cc:286:10: error: call to implicitly-deleted copy constructor of 'Rotwind' Log
mimedefang 2.78-1Dependencies installation failed Log
mira 4.9.6-1clang: error: argument to '-V' is missing (expected 1 value) Log
mlucas 14.1-1configure: error: in `/<>' Log
mona 1.4-17-1configure: error: C++ compiler not found Log
mongodb 1:2.6.12-3Undetected errorLog
monitoring-plugins 2.1.2-2Dependencies installation failed Log
mono 4.2.1.102+dfsg2-8dpkg-buildpackage: error: debian/rules build-arch gave error exit status 2 Log
mono-fuse 0.4.2+dfsg-4Undetected errorLog
monodevelop 5.10.0.871-2Undetected errorLog
mpd 0.19.18-1test/test_byte_reverse.cxx:52:26: error: 'alignas' attribute cannot be applied to types Log
mrs 6.0.5+dfsg-2Undetected errorLog
musescore 2.0.3+dfsg1-2aslider.h:40:31: error: base class has incomplete type Log 752124
mutt 1.6.2-3Dependencies installation failed Log 753437
mxt-app 1.27-2src/test/run_unit_tests.c:41:5: error: expression which evaluates to zero treated as a null pointer constant of type 'CMFixtureFunction' (aka 'int (*)(void **)') [-Werror,-Wnon-literal-null-conversion] Log
myodbc 5.1.10-3configure: error: Could not use the single thread MySQL client library, please check config.log for errors Log
mysql-workbench 6.3.4+dfsg-3Undetected errorLog
mysqmail 0.4.9-10.1dpkg-buildpackage: error: debian/rules build-arch gave error exit status 2 Log
nagios3 3.5.1.dfsg-2.1dpkg-buildpackage: error: debian/rules build-arch gave error exit status 2 Log
netqmail 1.06-5dpkg-buildpackage: error: debian/rules build-arch gave error exit status 2 Log
nghttp2 1.13.0-1dh_auto_test: make -j1 check VERBOSE=1 returned exit code 2 Log
nn 6.7.3-10make[2]: *** No rule to make target ' articles.h', needed by 'nn.o'. Stop. Log
npapi-vlc 2.0.6-4./control/nporuntime.h:225:13: error: static declaration of 'RuntimeNPClassGetProperty' follows non-static declaration Log
ns3 3.25+dfsg2-3Undetected errorLog
octave-parallel 3.1.0-2configure: error: could not enforce using C++11 features Log
ogamesim 20130107-1dpkg-buildpackage: error: debian/rules build-arch gave error exit status 2 Log
ogmrip 1.0.1-1ogmrip-encoding.c:1200:7: error: cast to union type from type 'int' not present in union Log
opari2 1.0.7+dfsg-5dh_install: missing files, aborting Log
open-cobol 1.1-2dh_auto_test: make -j1 check VERBOSE=1 returned exit code 2 Log
openafs 1.6.18.3-1Tests failures Log
openjdk-8 8u102-b14.1-2configure: error: GCC compiler is required. Try setting --with-tools-dir. Log
openlibm 0.5.3+dfsg-1Tests failures Log
openmsx 0.12.0-2clang: error: unable to execute command: Floating point exception Log
openmsx-catapult 0.12.0-1Undetected errorLog
opentoken 6.0b-5Undetected errorLog
openvpn-auth-ldap 2.0.3-6.1configure: error: Can't locate Objective C runtime headers Log
paexec 1.0.1-3dh_auto_test: mkcmake PREFIX=/usr MANDIR=/usr/share/man INFODIR=/usr/share/info SYSCONFDIR=/etc LIBDIR=/usr/lib/x86_64-linux-gnu LIBEXECDIR=/usr/lib/x86_64-linux-gnu test returned exit code 1 Log
pam-mysql 0.7~RC1-4.1configure: error: Cannot find pam headers. Please check if your system is ready for pam module development. Log
pandas 0.18.1-1Undetected errorLog
paw 1:2.14.04.dfsg.2-9Undetected errorLog
pcp 3.11.3.1access.o: r .L.str.1 : Error: additional symbol Log
pdf2htmlex 0.14.6+ds-2Undetected errorLog
pebl 1.0.2-3dpkg-buildpackage: error: debian/rules build-arch gave error exit status 2 Log
pesign 0.112-3clang: error: optimization flag '-fno-merge-constants' is not supported Log
pingus 0.7.6-3src/lisp/getters.hpp:33:15: error: no viable conversion from 'std::shared_ptr' to 'const lisp::Lisp *' Log
pitivi 0.97.1-1dpkg-shlibdeps: error: cannot continue due to the error above Log
plasma-desktop 4:5.6.5-1Dependencies installation failed Log
polybori 0.8.3-5.2PyPolyBoRi/monomial_wrapper.cc:50:64: error: call to non-static member function without an object argument Log
powerdevil 4:5.6.5-1Dependencies installation failed Log
prime-phylo 1.0.11-4PrimeOptionMap.hh:161:32: error: no function named 'operator<<' with type 'std::ostream &(std::ostream &, const beep::PrimeOptionMap &)' (aka 'basic_ostream &(basic_ostream &, const beep::PrimeOptionMap &)') was found in the specified scope Log
proftpd-dfsg 1.3.5a-1dpkg-buildpackage: error: debian/rules build-arch gave error exit status 2 Log
promoe 0.1.1-3coll.h:615:6: error: binding value of type 'const Xmms::Coll::Coll' to reference to type 'Xmms::Coll::Coll' drops 'const' qualifier Log
pure-ftpd 1.0.36-3.2configure: error: libmysqlclient is needed for MySQL support Log
py3cairo 1.10.0+dfsg-5Undetected errorLog
pykaraoke 0.7.5-1.1dpkg-buildpackage: error: debian/rules build-arch gave error exit status 2 Log
pymol 1.8.2.1+dfsg-1contrib/champ/champ.c:2787:3: error: unterminated function-like macro invocation Log
pyorbit 2.24.0-7.1dpkg-buildpackage: error: debian/rules build-arch gave error exit status 2 Log
pysparse 1.1-1.3dpkg-buildpackage: error: debian/rules build-arch gave error exit status 2 Log
python-astropy 1.2.1-1Undetected errorLog
python-cffi 1.7.0-1Tests failures Log
python-escript 4.2.0.1-4Undetected errorLog
python-osd 0.2.14-6dpkg-buildpackage: error: debian/rules build-arch gave error exit status 2 Log
qdjango 0.6.2-2dh_auto_test: make -j1 check returned exit code 2 Log
quickroute-gps 2.4-13Undetected errorLog
quixote 2.7~b2-1.1dpkg-buildpackage: error: debian/rules build-arch gave error exit status 2 Log
ratpoints 1:2.1.3-1 Log
rawtherapee 4.2-4dcraw.cc:8729:11: error: '(anonymous union at /<>/rtengine/dcraw.cc:8729:11)' cannot be defined in a type specifier Log
regina-normal 4.96-3ninteger.h:2294:16: error: assigning to 'mpz_ptr' (aka '__mpz_struct *') from incompatible type 'mpz_t *' (aka '__mpz_struct (*)[1]') Log
reprepro 4.17.1-1sourceextraction.c:135:2: error: illegal storage class on function Log
rheolef 6.7-1configure: error: CLANG compiler problem: g++ is unable to link with the std C++ library Log
ring 20160818.1.eb4fbc8~dfsg1-2configure: error: dbus does not compile when clang is used, rerun with --without-dbus Log
rnetclient 2016.0-2rnetclient.c:66:9: error: missing field 'key' initializer [-Werror,-Wmissing-field-initializers] Log
rr 4.3.0-1record_syscall.cc:2494:54: error: typename specifier refers to non-type member 'flock' in 'rr::X86Arch' Log
scalapack 1.8.0-12.3dpkg-buildpackage: error: debian/rules build-arch gave error exit status 2 Log 710395
scheme48 1.9-5Undetected errorLog
scite 3.6.6-1regex.h:1574:7: error: exception specification of explicitly defaulted move constructor does not match the calculated one Log
sdcc 3.5.0+dfsg-2Undetected errorLog
serd 0.22.0~dfsg0-2Undetected errorLog
sheepdog 0.8.3-4.1:1:9: error: unknown token in expression Log
shelltestrunner 1.3.5-6Dependencies installation failed Log
skalibs 0.47-1dpkg-buildpackage: error: debian/rules build-arch gave error exit status 2 Log
sks-ecc 0.93-6tfm/mpi.c:2565:15: error: unknown register name '%cc' in asm Log
snapper 0.2.4-1new_allocator.h:120:23: error: call to implicitly-deleted copy constructor of 'Client' Log
sniffles 0.0.1+ds-1Undetected errorLog
sofa-framework 1.0~beta4-11../../../modules/sofa/component/topology/QuadSetGeometryAlgorithms.h:113:14: error: inline declaration of 'areaProduct' follows non-inline definition Log
sord 0.14.0~dfsg0-2Undetected errorLog
soundmodem 0.20-5../matlib/mat.hh:452:4: error: assigning to 'unsigned int *' from incompatible type 'void *' Log
soup-sharp 2.42.2+git20151219-3Undetected errorLog
sparse 0.5.0-1test-dissect.c:50:25: error: initialization of flexible array member is not allowed Log
sphde 1.1.0-2./sasatom_x86_64.h:66:56: error: unsupported inline asm: input with type 'long' matching output with type 'char' Log
splint 3.1.2.dfsg1-2dpkg-buildpackage: error: debian/rules build-arch gave error exit status 2 Log
springlobby 0.255+dfsg-1Undetected errorLog
statsmodels 0.6.1-8/bin/sh: 1: ipython: not found Log
stdsyslog 0.03.1-2stdsyslog.c:549:121: error: format specifies type 'void *' but the argument has type 'char *' [-Werror,-Wformat-pedantic] Log
stoken 0.90-1configure: error: Package requirements (nettle >= 2.4) were not met Log
strongswan 5.5.0-1Tests failures Log
styx 2.0.1-1sysbase1.c:579:50: error: invalid token at start of a preprocessor expression Log
subtitleeditor 0.53.0-1document.cc:81:40: error: addition of default argument on redeclaration makes this constructor a copy constructor Log
subtle 0.11.3224-xi-2.2Undetected errorLog
supercollider 1:3.7.0~repack-3/bin/sh: 1: licensecheck: not found Log
syslog-ng 3.7.3-1Tests failures Log
syslog-ng-incubator 0.5.0-1dh_auto_test: make -j1 check VERBOSE=1 returned exit code 2 Log
sysprof 3.20.0-3sp-capture-reader.c:657:23: error: variable 'j' used in loop condition not modified in loop body [-Werror,-Wfor-loop-analysis] Log
tau 2.17.3.1.dfsg-4dpkg-buildpackage: error: debian/rules build-arch gave error exit status 2 Log
tbb 4.3~20150611-2Tests failures Log
tcptrack 1.4.2-2./IPAddress.h:19:58: error: all paths through this function will call itself [-Werror,-Winfinite-recursion] Log
theano 0.8.2-3Tests failures Log
tokyocabinet 1.4.48-10dh_auto_test: make -j1 check VERBOSE=1 returned exit code 2 Log
triggerhappy 0.4.0-2./evtable_SW.inc:12:8: error: array designator index (15) exceeds array bounds (15) Log
troffcvt 1.04-23Undetected errorLog
tudu 0.8.2-1Undetected errorLog
turnserver 0.7.3-4turnserver.c:959:57: error: size argument in 'memcmp' call is a comparison [-Werror,-Wmemsize-comparison] Log
udisks2 2.1.7-2dh_auto_test: make -j1 check VERBOSE=1 returned exit code 2 Log
upx-ucl 3.91-2./bele_policy.h:156:9: error: unused typedef 'acc_cta_t__39' [-Werror,-Wunused-local-typedef] Log
varnish 4.1.3-2clang: error: optimization flag '-fexcess-precision=standard' is not supported Log
varnish-modules 0.9.1-3Tests failures Log
vdr-plugin-softhddevice 0.6.0+git20160108-1make[1]: *** No rule to make target 'alsa/iatomic.h', needed by 'softhddev.o'. Stop. Log
vdr-plugin-xineliboutput 1.1.0+cvs20150907-3make[2]: *** No rule to make target 'dbus/dbus-glib.h', needed by 'tools/gnome_screensaver.o'. Stop. Log
vflib3 3.6.14.dfsg-3+nmu2dpkg-buildpackage: error: debian/rules build-arch gave error exit status 2 Log
visp 3.0.0-4Tests failures Log
vowpal-wabbit 8.1.1-1Tests failures Log
vsftpd 3.0.3-6Dependencies installation failed Log
webcamoid 7.2.0+dfsg1-1src/akvideocaps.cpp:33:47: error: non-aggregate type 'const QVector' cannot be initialized with an initializer list Log
webkitgtk-sharp3 2.0.0+git20151221-3Undetected errorLog
wesnoth-1.12 1:1.12.6-1Undetected errorLog
wmaker 0.95.7-6ld: final link failed: Bad value Log
wvdial 1.61-4.1uniconfgen.h:323:19: error: no class named 'Iter' in 'UniConfGen' Log
wvstreams 4.6.1-10./include/wvscatterhash.h:186:46: error: invalid use of non-static data member 'xstatus' Log
xapian-core 1.2.23-1Undetected errorLog
xbubble 0.5.11.2-3.3clang: error: optimization flag '-finline-functions' is not supported Log
xcftools 1.0.7-6Undetected errorLog
xhprof 0.9.4-2configure: error: in `/<>/extension' Log
xine-lib-1.2 1.2.6-1.1dpkg-buildpackage: error: debian/rules build-arch gave error exit status 2 Log
xmms2 0.8+dfsg-16coll.h:615:6: error: binding value of type 'const Xmms::Coll::Coll' to reference to type 'Xmms::Coll::Coll' drops 'const' qualifier Log
xmpi 2.2.3b8-13.2configure: error: cannot continue -- cannot find Log
xsp 4.2-2Undetected errorLog
yp-tools 3.3-4do_ypcall.c:460:27: error: cast from 'caddr_t' (aka 'char *') to 'struct ypresp_val *' increases required alignment from 1 to 8 [-Werror,-Wcast-align] Log
z80ex 1.1.21-1dh_install: missing files, aborting Log
zabbix 1:3.0.4+dfsg-1configure: error: Not found mysqlclient library Log
zbackup 1.4.4-1shared_ptr.h:431:32: error: too few arguments provided to function-like macro invocation Log
zeitgeist 0.9.16-0.1controller.cpp:131:19: error: cannot cast from type 'gboolean (ZeitgeistFTS::Controller::*)()' to pointer type 'GSourceFunc' (aka 'int (*)(void *)') Log
zeroinstall-injector 2.10-2Tests failures Log
zvbi 0.2.35-11dh_auto_test: make -j1 check VERBOSE=1 returned exit code 2 Log
zypper 1.12.4-1SolvIterMixin.h:167:60: error: invalid use of incomplete type 'zypp::asPoolItem' Log
381 errors
Return to the list