Debian Package rebuild

Rebuild of the Debian archive with clang

"No matching member or constructor call" build failure(s)
clang 3.8.1
Return to the list

Versions: 2.9 - 3.0 - 3.1 - 3.2 - 3.3 - 3.4 - 3.4.2 - 3.5.0 - 3.6.0 - 3.8.1
PackageVersionSupposed error messageFull log Bug report
dnaclust 3-4./multi_dim.hpp:62:8: error: no matching constructor for initialization of 'std::range_error' Log
liblip 2.0.0-1.2tnt_sparse_matrix_csr.h:97:3: error: no matching constructor for initialization of 'Array1D' Log
pdns-recursor 4.0.1-1optional.hpp:678:15: error: no matching member function for call to 'construct' Log
3 errors
Return to the list