Debian Package rebuild

Rebuild of the Debian archive with clang

"Expected declaration (#define missing?)" build failure(s)
clang 3.9.1
Return to the list

Versions: 2.9 - 3.0 - 3.1 - 3.2 - 3.3 - 3.4 - 3.4.2 - 3.5.0 - 3.6.0 - 3.8.1 - 3.9.1 - 4.0.1 - 5.0
PackageVersionSupposed error messageFull log Bug report
abgate 1.1.8-1ustring.h:256:13: error: expected ';' at end of declaration list Log
agave 0.4.7-2.1ustring.h:256:13: error: expected ';' at end of declaration list Log
amsynth 1.6.4-1ustring.h:224:20: warning/usr/include/glibmm-2.4/glibmm/ustring.h:256:13: error: expected ';' at end of declaration list Log
ants 2.1.0-5itkSmartPointer.h:178:20: error: expected ';' at end of declaration list Log
apt 1.5~beta1libnoprofile.c:22:5: error: expected parameter declarator Log
aptitude 0.8.8-1trackable.h:40:59: error: expected ';' at end of declaration list Log
asc 2.6.1.0-2trackable.h:40:59: error: expected ';' at end of declaration list Log
ats-lang-anairiats 0.2.11-1bool.cats:42:5: error: expected parameter declarator Log
ats2-lang 0.2.9-1./prelude/CATS/integer.cats:42:5: error: expected parameter declarator Log
buffy 1.5-4trackable.h:40:59: error: expected ';' at end of declaration list Log
cclive 0.9.3-0.1ustring.h:256:13: error: expected ';' at end of declaration list Log
chasen 2.4.5-35print.c:186:16: error: expected parameter declarator Log
ciftilib 1.5.1-1ustring.h:256:13: error: expected ';' at end of declaration list Log
couriergrey 0.3.2-5ustring.h:256:13: error: expected ';' at end of declaration list Log
crash 7.1.8-2./../include/libiberty.h:616:12: error: expected parameter declarator Log
dcap 2.47.10-3./util.h:14:12: error: expected parameter declarator Log 755964
diagnostics 0.3.3-12../../../diagnostics/macros/invariance_annotation.hpp:66:40: error: expected ';' at end of declaration list Log 751904
distcc 3.1-6.2src/snprintf.h:30:5: error: expected parameter declarator Log
eiciel 0.9.11-3ustring.h:256:13: error: expected ';' at end of declaration list Log
elastix 4.8-11itkSmartPointer.h:178:20: error: expected ';' at end of declaration list Log
flowcanvas 0.7.1+dfsg0-0.4ustring.h:256:13: error: expected ';' at end of declaration list Log
fribidi 0.19.7-1fribidi-char-sets-cap-rtl.c:109:6: error: expected expression Log
ganv 1.4.2~dfsg0-2ustring.h:256:13: error: expected ';' at end of declaration list Log
gbgoffice 1.4-10ustring.h:256:13: error: expected ';' at end of declaration list Log
gcc-arm-none-eabi 15:5.4.1+svn241155-1../../../src/libiberty/../include/libiberty.h:628:12: error: expected parameter declarator Log
gconfmm2.6 2.28.3-1trackable.h:40:59: error: expected ';' at end of declaration list Log
gdal 2.1.2+dfsg-5cpl_port.h:858:5: error: expected parameter declarator Log
gip 1.7.0-1-4ustring.h:256:13: error: expected ';' at end of declaration list Log
gmchess 0.29.6-2.1ustring.h:256:13: error: expected ';' at end of declaration list Log
gmlive 0.22.3-1ustring.h:256:13: error: expected ';' at end of declaration list Log
gobby 0.5.0-8.1ustring.h:256:13: error: expected ';' at end of declaration list Log
gr-iqbal 0.37.2-7cxvec.h:45:15: error: expected ';' at end of declaration list Log
granule 1.4.0-7-6ustring.h:256:13: error: expected ';' at end of declaration list Log
gsmartcontrol 0.8.7-1.2ustring.h:256:13: error: expected ';' at end of declaration list Log
gtg-trace 0.2-2+dfsg-2C/paje_GTGBasic1_c.c:14:12: error: expected parameter declarator Log
gtkdataboxmm 0.9.4-4ustring.h:256:13: error: expected ';' at end of declaration list Log
gtkguitune 0.8-6ustring.h:256:13: error: expected ';' at end of declaration list Log
gtkspellmm 3.0.5+dfsg-1ustring.h:256:13: error: expected ';' at end of declaration list Log
hexxagon 1.0pl1-3.1ustring.h:256:13: error: expected ';' at end of declaration list Log
icinga 1.13.4-2./../include/snprintf.h:29:5: error: expected parameter declarator Log
jd 1:2.8.9-150226-6ustring.h:256:13: error: expected ';' at end of declaration list Log
julia 0.4.7-6init.c:608:12: error: expected parameter declarator Log
ladish 1+dfsg0-5.1ustring.h:256:13: error: expected ';' at end of declaration list Log
libesmtp 1.0.6-4.2./missing.h:48:5: error: expected parameter declarator Log
libglademm2.4 2.6.7-5ustring.h:256:13: error: expected ';' at end of declaration list Log
libgnomecanvasmm2.6 2.26.0-2ustring.h:256:13: error: expected ';' at end of declaration list Log
libofx 1:0.9.10-2ustring.h:256:13: error: expected ';' at end of declaration list Log
libview 0.6.6-2.1 using value_type = gunichar;256:13: error: expected ';' at end of declaration list Log
libwfut 0.2.3-4trackable.h:40:59: error: expected ';' at end of declaration list Log
libwnckmm 0.1.1-2ustring.h:256:13: error: expected ';' at end of declaration list Log
ll-scope 0.2.1-3ustring.h:256:13: error: expected ';' at end of declaration list Log
lvtk 1.2.0~dfsg0-2ustring.h:256:13: error: expected ';' at end of declaration list Log
mangler 1.2.5-4ustring.h:256:13: error: expected ';' at end of declaration list Log
mawk 1.3.3-17print.c:85:11: error: expected parameter declarator Log
mcelog 147+dfsg-1memutil.c:66:5: error: expected parameter declarator Log
modglue 1.17-3trackable.h:40:59: error: expected ';' at end of declaration list Log
mtools 4.0.18-2mainloop.c:89:15: error: expected ')' Log
nitrogen 1.6.0-1ustring.h:256:13: error: expected ';' at end of declaration list Log
nvptx-tools 0.20170301-3./../include/libiberty.h:627:12: error: expected parameter declarator Log
openhpi 3.6.1-2.2session.cpp:121:17: error: expected expression Log
paman 0.9.4-1ustring.h:256:13: error: expected ';' at end of declaration list Log
paprefs 0.9.10-2ustring.h:256:13: error: expected ';' at end of declaration list Log
pavucontrol 3.0-3.1ustring.h:256:13: error: expected ';' at end of declaration list Log
pavumeter 0.9.3-4ustring.h:256:13: error: expected ';' at end of declaration list Log
pchar 1.5-3./pc.h:28:15: error: expected identifier Log
pdfchain 1:0.4.4.2-1ustring.h:256:13: error: expected ';' at end of declaration list Log
pink-pony 1.4.1-2trackable.h:40:59: error: expected ';' at end of declaration list Log
python-visual 1:5.12-1.6ustring.h:256:13: error: expected ';' at end of declaration list Log
referencer 1.2.2-2ustring.h:256:13: error: expected ';' at end of declaration list Log
regexxer 0.10-3trackable.h:40:59: error: expected ';' at end of declaration list Log
sdcc 3.5.0+dfsg-2./../include/libiberty.h:616:12: error: expected parameter declarator Log
sdpa 7.3.9+dfsg-1mexFprintf.c:32:5: error: expected parameter declarator Log
snap-aligner 1.0~beta.18+dfsg-1SNAPLib/AlignerContext.cpp:341:34: error: expected ')' Log
sooperlooper 1.7.3~dfsg0-3trackable.h:40:59: error: expected ';' at end of declaration list Log
stardict 3.0.1-9.3trackable.h:40:59: error: expected ';' at end of declaration list Log
synfig 1.0.2-1trackable.h:40:59: error: expected ';' at end of declaration list Log
synfigstudio 1.0.2-1trackable.h:40:59: error: expected ';' at end of declaration list Log
tmispell-voikko 0.7.1-4ustring.h:256:13: error: expected ';' at end of declaration list Log
urjtag 0.10+r2007-1.2../../include/libiberty.h:589:12: error: expected parameter declarator Log
visualboyadvance 1.8.0.dfsg-4debugger.cpp:1725:36: error: expected ')' Log
vocproc 0.2.1-2ustring.h:256:13: error: expected ';' at end of declaration list Log
81 errors
Return to the list