Debian Package rebuild

Rebuild of the Debian archive with clang

"Implicit instantiation" build failure(s)
clang 3.9.1
Return to the list

Versions: 2.9 - 3.0 - 3.1 - 3.2 - 3.3 - 3.4 - 3.4.2 - 3.5.0 - 3.6.0 - 3.8.1 - 3.9.1 - 4.0.1 - 5.0
PackageVersionSupposed error messageFull log Bug report
blitz++ 1:0.10+ds-2../../blitz/array/expr.h:111:26: error: implicit instantiation of undefined template 'blitz::FastTV2Iterator' Log
choreonoid 1.5.0+dfsg-0.1ItemManager.h:144:35: error: implicit instantiation of undefined template 'boost::shared_ptr' Log
cvc3 2.4.1-5.1./minisat_global.h:154:43: error: implicit instantiation of undefined template 'MiniSat::STATIC_ASSERTION_FAILURE' Log
fflas-ffpack 2.2.2-4type_traits:1831:24: error: implicit instantiation of undefined template 'std::__make_unsigned_selector' Log
minisat+ 1.0-4ADTs/Global.h:281:43: error: implicit instantiation of undefined template 'STATIC_ASSERTION_FAILURE' Log
5 errors
Return to the list