Debian Package rebuild

Rebuild of the Debian archive with clang

"Cannot find member in the struct" build failure(s)
clang 3.9.1
Return to the list

Versions: 2.9 - 3.0 - 3.1 - 3.2 - 3.3 - 3.4 - 3.4.2 - 3.5.0 - 3.6.0 - 3.8.1 - 3.9.1 - 4.0.1 - 5.0
PackageVersionSupposed error messageFull log Bug report
aegisub 3.2.2+dfsg-3util.cpp:30:2: error: no member named 'this_thread' in namespace 'std'; did you mean 'boost::this_thread'? Log
android-platform-system-tools-aidl 1:7.0.0+r33-1strings.h:47:23: error: no member named 'next' in namespace 'std' Log
cgit 1.1+git2.10.2-3../filter.c:387:10: error: no member named '__fprintf_chk' in 'struct cgit_filter' Log
cyphesis-cpp 0.6.2-2stream.h:306:19: error: no member named 'm_poly' in 'WFMath::Polygon<2>' Log
ext3grep 0.10.2-3./is_blockdetection.h:46:33: error: no member named 'memset' in namespace 'std'; did you mean simply 'memset'? Log 755542
gridengine 8.1.9+dfsg-4../libs/gdi/sge_gdi_ctx.c:1054:19: error: no member named '__dprintf_chk' in 'struct sge_csp_path_class_str' Log
k3b 2.0.3a-2k3bffmpegwrapper.cpp:141:17: error: no member named 'av_open_input_file' in the global namespace Log
kodi-pvr-hdhomerun 2.4.2+git20160820-2HDHomeRunTuners.cpp:43:25: error: no member named 'hash' in namespace 'std' Log
libnftnl 1.0.7-1object.c:383:19: error: no member named '__builtin___snprintf_chk' in 'struct obj_ops' Log 755956
meep 1.3-4cstdlib:124:9: error: no member named 'div_t' in the global namespace; did you mean '::meep::div_t'? Log
meep-lam4 1.3-2cstdlib:124:9: error: no member named 'div_t' in the global namespace; did you mean '::meep::div_t'? Log
meep-mpi-default 1.3-3cstdlib:124:9: error: no member named 'div_t' in the global namespace; did you mean '::meep::div_t'? Log
meep-mpich2 1.3-4cstdlib:124:9: error: no member named 'div_t' in the global namespace; did you mean '::meep::div_t'? Log
meep-openmpi 1.3-3cstdlib:124:9: error: no member named 'div_t' in the global namespace; did you mean '::meep::div_t'? Log
mercator 0.3.3-4polygon_intersect.h:667:37: error: no member named 'm_orient' in 'WFMath::Polygon<2>' Log
muparserx 4.0.7+dfsg-2mpFuncNonCmplx.cpp:99:39: error: no member named 'cbrt' in namespace 'std'; did you mean simply 'cbrt'? Log
openipmi 2.0.22-1.1ipmi_sim.c:612:11: error: no member named '__printf_chk' in 'struct emu_out_s' Log
ros-robot-model 1.12.6-1pose.h:78:30: error: no member named 'stod' in namespace 'std' Log
vtk6 6.3.0+dfsg1-7cstdlib:124:11: error: no member named 'div_t' in the global namespace; did you mean 'dev_t'? Log
xplanet 1.3.0-5cstdlib:124:9: error: no member named 'div_t' in the global namespace; did you mean '::sgp4sdp4::div_t'? Log
20 errors
Return to the list