Debian Package rebuild

Rebuild of the Debian archive with clang

"Argument unused caused failure" build failure(s)
clang 3.9.1
Return to the list
Unknown or unused arguments triggers errors with -Werror:
clang -Werror -ggdb3 foo.c

Versions: 2.9 - 3.0 - 3.1 - 3.2 - 3.3 - 3.4 - 3.4.2 - 3.5.0 - 3.6.0 - 3.8.1 - 3.9.1 - 4.0.1 - 5.0
PackageVersionSupposed error messageFull log Bug report
librdkafka 0.9.5-2DBG: compile check for PIC (HAVE_PIC) failed: gcc -g -O2 -fdebug-prefix-map=/<>=. -specs=/usr/share/dpkg/no-pie-compile.specs -fstack-protector-strong -Wformat -Werror=format-security -Wdate-time -D_FORTIFY_SOURCE=2 -I/usr/include -g -O2 -Wall -Werror -fPIC _mkltmpyaSCpy.c -o _mkltmpyaSCpy.c.o -specs=/usr/share/dpkg/no-pie-link.specs -Wl,-z,relro -Wl,-z,now -L/usr/lib/x86_64-linux-gnu: clang: error: argument unused during compilation: '-specs=/usr/share/dpkg/no-pie-compile.specs' Log
python-pyxattr 0.6.0-2clang: error: argument unused during compilation: '-specs=/usr/share/dpkg/no-pie-compile.specs' Log
xen 4.8.1-1+deb9u1clang: error: argument unused during compilation: '-Wa,--strip-local-absolute' Log
3 errors
Return to the list