Debian Package rebuild

Rebuild of the Debian archive with clang

"Forward declaration of class cannot have a nested name specifier" build failure(s)
clang 4.0.1
Return to the list

Versions: 2.9 - 3.0 - 3.1 - 3.2 - 3.3 - 3.4 - 3.4.2 - 3.5.0 - 3.6.0 - 3.8.1 - 3.9.1 - 4.0.1 - 5.0
PackageVersionSupposed error messageFull log Bug report
enemylines3 1.2-8./generators/generators.h:2:7: error: forward declaration of class cannot have a nested name specifier Log
geotranz 3.3-1../../GEOTRANS3/java_gui/geotrans3/jni/JNICCSObjectTranslator.h:14:7: error: forward declaration of class cannot have a nested name specifier Log
sipxtapi 3.3.0~test17-2.1../../../../sipXportLib/src/test/sipxunit/TestOutputter.h:18:7: error: forward declaration of class cannot have a nested name specifier Log
3 errors
Return to the list