Debian Package rebuild

Rebuild of the Debian archive with clang

"No matching function call" build failure(s)
clang 4.0.1
Return to the list

Versions: 2.9 - 3.0 - 3.1 - 3.2 - 3.3 - 3.4 - 3.4.2 - 3.5.0 - 3.6.0 - 3.8.1 - 3.9.1 - 4.0.1 - 5.0
PackageVersionSupposed error messageFull log Bug report
android-platform-system-core 1:7.0.0+r33-2adb/adb_auth_host.cpp:95:5: error: no matching function for call to 'RSA_get0_key' Log
asl 0.1.7-2aslMATFormat.cxx:49:3: error: no matching function for call to 'Mat_VarWrite' Log
cython 0.25.2-1cpdef_extern_func.cpp:1640:25: error: no matching function for call to '__Pyx_CFunc_const__char______const__char________int___to_py' Log
dbus-c++ 0.9.0-8../../include/dbus-c++/dispatcher.h:259:5: error: no matching function for call to '_init_threading' Log
imagevis3d 3.1.0-5IO/IOManager.cpp:2599:19: error: no matching function for call to 'bind' Log
libffado 2.3.0-2dispatcher.h:259:5: error: no matching function for call to '_init_threading' Log
trackballs 1.1.4-4.3./guile.cc.x:2:2: error: no matching function for call to 'scm_c_define_gsubr' Log
7 errors
Return to the list