Debian Package rebuild

Rebuild of the Debian archive with clang

"C++11 requires a space between literal and identifier" build failure(s)
clang 4.0.1
Return to the list

Versions: 2.9 - 3.0 - 3.1 - 3.2 - 3.3 - 3.4 - 3.4.2 - 3.5.0 - 3.6.0 - 3.8.1 - 3.9.1 - 4.0.1 - 5.0
PackageVersionSupposed error messageFull log Bug report
cantata 2.0.1.ds1-2utils.cpp:776:38: error: invalid suffix on literal; C++11 requires a space between literal and identifier [-Wreserved-user-defined-literal] Log
httraqt 1.4.8-1htsglobal.h:211:80: error: invalid suffix on literal; C++11 requires a space between literal and identifier [-Wreserved-user-defined-literal] Log
llvm-toolchain-4.0 1:4.0.1-1GDBRemoteCommunication.cpp:43:48: error: invalid suffix on literal; C++11 requires a space between literal and identifier [-Wreserved-user-defined-literal] Log
octave-sparsersb 1.0.5-1sparsersb.cc:100:49: error: invalid suffix on literal; C++11 requires a space between literal and identifier [-Wreserved-user-defined-literal] Log
qt-gstreamer 1.2.0-4basedelegate.cpp:158:53: error: invalid suffix on literal; C++11 requires a space between literal and identifier [-Wreserved-user-defined-literal] Log
5 errors
Return to the list