Debian Package rebuild

Rebuild of the Debian archive with clang

"Linker error" build failure(s)
clang 5.0
Return to the list

Versions: 2.9 - 3.0 - 3.1 - 3.2 - 3.3 - 3.4 - 3.4.2 - 3.5.0 - 3.6.0 - 3.8.1 - 3.9.1 - 4.0.1 - 5.0
PackageVersionSupposed error messageFull log Bug report
bash 4.4-5clang: error: linker command failed with exit code 1 (use -v to see invocation) Log
batctl 2017.2-2clang: error: linker command failed with exit code 1 (use -v to see invocation) Log
batmand 0.3.2-17clang: error: linker command failed with exit code 1 (use -v to see invocation) Log
blobwars 2.00-1clang: error: linker command failed with exit code 1 (use -v to see invocation) Log 753844
ecdsautils 0.3.2+git20151018-2 clang: error: linker command failed with exit code 1 (use -v to see Log
efivar 31-1clang: error: linker command failed with exit code 1 (use -v to see invocation) Log
encfs 1.9.2-2 clang: error: linker command failed with exit code 1 (use -v to see Log
fastd 18-2clang: error: linker command failed with exit code 1 (use -v to see invocation) Log
llvmlite 0.19.0-2clang: error: linker command failed with exit code 1 (use -v to see invocation) Log
mariadb-10.1 10.1.25-1clang: error: linker command failed with exit code 1 (use -v to see invocation) Log
obex-data-server 0.4.6-1clang: error: linker command failed with exit code 1 (use -v to see invocation) Log
python2.7 2.7.13-4clang: error: linker command failed with exit code 1 (use -v to see invocation) Log
python3.5 3.5.4-2clang: error: linker command failed with exit code 1 (use -v to see invocation) Log
scrm 1.7.2-1clang: error: linker command failed with exit code 1 (use -v to see invocation) Log
splat 1.4.0-3clang: error: linker command failed with exit code 1 (use -v to see invocation) Log
stockfish 8-3clang: error: linker command failed with exit code 1 (use -v to see invocation) Log
systemd 234-2clang: error: linker command failed with exit code 1 (use -v to see invocation) Log
tvoe 0.1-1clang: error: linker command failed with exit code 1 (use -v to see invocation) Log
18 errors
Return to the list