Debian Package rebuild

Rebuild of the Debian archive with clang

"Not categorized" build failure(s)
clang 5.0
Return to the list

Versions: 2.9 - 3.0 - 3.1 - 3.2 - 3.3 - 3.4 - 3.4.2 - 3.5.0 - 3.6.0 - 3.8.1 - 3.9.1 - 4.0.1 - 5.0
PackageVersionSupposed error messageFull log Bug report
0ad 0.0.21-2../../build/unix/gold/ld: error: hidden symbol 'ceil' is not defined locally Log
389-dsgw 1.1.11-2../edit.c:30:5: error: third parameter of 'main' (environment) must be of type 'char **' Log
9base 1:6-7n1.c:124:5: error: unterminated function-like macro invocation Log
aconnectgui 0.9.0rc2-1-10configure: error: Sufficiently new version of libasound not found. Log 684508
acpid 1:2.0.28-1configure: error: "asprintf() not found" Log
alljoyn-core-1509 15.09a+dfsg.1-1alljoyn_c/src/PermissionConfigurationListener.cc:33:17: error: using directive refers to implicitly-defined namespace 'std' [-Werror] Log
alljoyn-core-1604 16.04a+dfsg.1-1alljoyn_c/src/PermissionConfigurationListener.cc:32:17: error: using directive refers to implicitly-defined namespace 'std' [-Werror] Log
apbs 1.4-1Undetected errorLog
apron 0.9.10-9ppl.hh:66465:8: error: missing 'typename' prior to dependent type template name 'OR_Matrix::Pseudo_Row' Log
arj 3.10.22-15Undetected errorLog
assimp 3.3.1~dfsg-5D3MFImporter.cpp:230:29: error: invalid operands to binary expression ('float (*)(const char *, const char *)' and 'nullptr_t') Log
asterisk-espeak 3.0-3utils.h:1049:15: error: blocks support disabled - compile with -fblocks or pick a deployment target that supports them Log
asterisk-flite 2.3-1utils.h:1049:15: error: blocks support disabled - compile with -fblocks or pick a deployment target that supports them Log
asterisk-opus 13.7+20161113-3utils.h:1049:15: error: blocks support disabled - compile with -fblocks or pick a deployment target that supports them Log
aubio 0.4.5-1Undetected errorLog
autodocksuite 4.2.6-3configure: error: in `/<>/autodock' Log
avifile 1:0.7.48~20090503.ds-20common/avm_output.cpp:20:12: error: qualified reference to 'AvmOutput' is a constructor name rather than a type in this context Log
bagel 0.0~git20170109-1rmawindow.cc:343:16: error: explicit instantiation of 'bagel::RMATask' must occur in namespace 'bagel' Log
ball 1.4.3~beta1-3Tests failures Log 755225
bing 1.3.5-2bing_misc.c:208:46: error: too many arguments provided to function-like macro invocation Log
binutils-mingw-w64 7.4dh_auto_test: make -j1 check returned exit code 2 Log
blktap 2.0.90-4libvhd.c:1073:2: error: indirection of non-volatile null pointer will be deleted, not trap [-Werror,-Wnull-dereference] Log
bmusb 0.7.0-2bmusb.cpp:635:16: error: 'target' attribute takes one argument Log
boinc 7.8.1+dfsg-1configure: error: in `/<>/boinc-7.8.1+dfsg' Log
ceph 10.2.5-7.2./librbd/AioImageRequestWQ.h:36:69: error: 'typename' keyword used on a non-type Log 749083
cernlib 20061220+dfsg3-4.3Undetected errorLog
cgal 4.9-1Undetected errorLog
chealpix 3.30.0-4configure: error: in `/<>' Log
cigi-ccl 3.3.3a+svn818-10dh_install: missing files, aborting Log
clblas 2.12-1dh_install: missing files, aborting Log
clfft 2.12.2-1dh_install: missing files, aborting Log
cmocka 1.1.1-1Tests failures Log
cmtk 3.3.1-1.2osconfig.h:1117:2: error: DCMTK was configured to use the C++11 STL, but your compiler is not configured for building with C++11 features. Log
codec2 0.6-1Undetected errorLog
coinor-flopc++ 1.0.6-3.1./MP_set.hpp:208:14: error: no matching conversion for functional-style cast from 'const flopc::SUBSETREF' to 'flopc::MP_domain' Log
colobot 0.1.10-2singleton.h:45:16: error: instantiation of variable 'CSingleton::m_instance' required here, but no definition is available [-Werror,-Wundefined-var-template] Log
comedilib 0.10.2-4clang: error: clang frontend command failed with exit code 70 (use -v to see invocation) Log
cpluff 0.1.4+dfsg1-1cpluff.c:84:35: error: too many arguments provided to function-like macro invocation Log
cssc 1.4.0-5Tests failures Log
cwidget 0.5.17-6basic_string.h:146:19: error: union member '_M_local_buf' has a non-trivial constructor Log
davix 0.6.6-1Tests failures Log
dbuskit 0.1.1-2configure: error: Objective C preprocessor "/lib/cpp" fails sanity check Log
dicom3tools 1.00~20170222075252-1./Imakefile:177:3: error: invalid preprocessing directive Log
dicomscope 3.6.0-16osconfig.h:1117:2: error: DCMTK was configured to use the C++11 STL, but your compiler is not configured for building with C++11 features. Log
din 5.2.1-5main.cc:296:49: error: non-aggregate type 'const color' cannot be initialized with an initializer list Log
directfb 1.7.7-5./String.h:126:51: error: format argument not a string type Log
dnsdist 1.1.0-2configure: error: Could not find libre2 Log
dpdk 16.11.2-4error: unknown target CPU 'generic' Log
dropbear 2017.75-2tomcrypt_macros.h:269:24: error: constraint 'I' expects an integer constant expression Log
dspdfviewer 1.15.1-1hyperlinkarea.cpp:35:18: error: zero as null pointer constant [-Werror,-Wzero-as-null-pointer-constant] Log
duo-unix 1.9.21-1dpkg-shlibdeps: error: cannot continue due to the error above Log
dx 1:4.4.4-10edfio.c:329:14: error: static declaration of 'mkfifo' follows non-static declaration Log 743003
efibootmgr 15-1make[3]: *** No rule to make target 'efivar.h', needed by 'efibootmgr.o'. Stop. Log 753644
ekg2 1:0.4~pre+20120506.1-13Makefile.am:144: error: 'plugins/autoresponder/autoresponder.la' is not a standard libtool library name Log
elpa 2016.05.001-4clang: error: gcc preprocessor command failed with exit code 254 (use -v to see invocation)clang: error: Log
ergo 3.5-1configure: error: in `/<>' Log
esperanza 0.4.0+git20091017-5coll.h:615:6: error: binding value of type 'const Xmms::Coll::Coll' to reference to type 'Xmms::Coll::Coll' drops 'const' qualifier Log
esys-particle 2.3.5+dfsg1-2./SphAggGougeBlock.hpp:39:37: error: no viable conversion from '__normal_iterator, std::allocator > >::const_pointer, [...]>' to '__normal_iterator, std::allocator > >::pointer, [...]>' Log
fbpanel 7.0-3Undetected errorLog
ffmpeg 7:3.3.3-3dh_auto_test: make -j16 check -k returned exit code 2 Log
fgrun 2016.4.0-1Undetected errorLog
firebird3.0 3.0.2.32703.ds4-9libtool.m4: error: problem compiling CXX test program Log
fis-gtm 6.3-000A-1g_msf.si:21:12: error: unknown token in expression Log
frama-c 20170501+phosphorus+dfsg-1configure: error: in `/<>/frama-c-20170501+phosphorus+dfsg/src/plugins/e-acsl/contrib/libjemalloc' Log
frame 2.5.0-3x11/device_x11.cpp:126:13: error: moving a temporary object prevents copy elision [-Werror,-Wpessimizing-move] Log
freeciv 2.5.9-1configure: error: selected client 'qt' cannot be built: Missing Qt5 development files Log
freefem3d 1.0pre10-3.4libtool.m4: error: problem compiling CXX test program Log
freelan 2.0-4build/release/libs/cryptoplus/src/integer.cpp:69:25: error: instantiation of variable 'cryptoplus::pointer_wrapper::deleter' required here, but no definition is available [-Werror,-Wundefined-var-template] Log
ga 5.4~beta~r10636+dfsg-5configure: error: f2c string convention is neither after args nor after string Log
gauche-c-wrapper 0.6.1-8dh_auto_test: make -j1 check VERBOSE=1 returned exit code 2 Log
gbsplay 0.0.93-2Undetected errorLog
geant321 1:3.21.14.dfsg-11Undetected errorLog
getfem++ 5.2+dfsg1-4configure: error: g++ do not support option -std=c++11. Update g++ to at least release 4.8.1. Log
gforth 0.7.3+dfsg-4Undetected errorLog
gltron 0.70final-12.1configure: error: OpenGL is not installed Log
gnucap 1:0.36~20091207-2./mg_.h:134:19: error: variable has incomplete type 'C_Comment' Log
gnustep-base 1.24.9-3.1configure: error: Could not find Objective-C headers Log
golang-1.7 1.7.6-2Undetected errorLog
golang-1.8 1.8.3-2./test.bash: line 18: sysctl: command not found Log
google-perftools 2.5-2.2Undetected errorLog
gpg-remailer 3.03.00-2mail/../cleartextmail/../mailer/send.f:11:17: error: cannot cast 'Mailer' to its private base class 'MailerBase' Log
grml2usb 0.15.4mbr.S:38:22: error: unknown token in expression Log
grub 0.97-72configure: error: GRUB requires GAS .code16 addr32 support; upgrade your binutils Log
gsequencer 0.8.10-1ags/lib/ags_function.c:438:3: error: illegal storage class on function Log
gstreamermm-1.0 1.8.0+dfsg-3../gstreamermm/caps.h:667:18: error: variable has incomplete type 'Gst::Structure' Log
gtkmm3.0 3.22.1-1gtk-demo/demowindow.cc:54:7: error: 'auto' return without trailing return type; deduced return types are a C++14 extension Log
guymager 0.8.4-2aewf.cpp:143:12: error: field has incomplete type 'uint []' Log
healpix-cxx 3.30.0-6configure: error: in `/<>' Log
helpviewer.app 0.3-8clang: error: invalid value 'ISO-8859-1' in '-finput-charset=ISO-8859-1' Log
hhsuite 3.0~beta2+dfsg-3Undetected errorLog
hugs98 98.200609.21-5.4tools/make_bootlib: 68: tools/make_bootlib: -D__HUGS__: not found Log
hyphy 2.2.7+dfsg-1calcnode2.cpp:600:29: error: restrict requires a pointer or reference ('_Parameter' (aka 'double') is invalid) Log
idjc 0.8.16-1configure: error: math library is missing critical function Log
igraph 0.7.1-2.1dh_auto_test: make -j16 check VERBOSE=1 returned exit code 2 Log
imvirt 0.9.6-4vmware.c:65:5: error: invalid operand for instruction Log
isc-kea 1.1.0-1configure: error: Missing required header files. Log
jalv 1.6.0~dfsg0-2Undetected errorLog
kmag 4:16.08.0-1accessibleobject.h:718:38: error: no function named 'operator<<' with type 'QDebug (QDebug, const QAccessibleClient::AccessibleObject &)' was found in the specified scope Log
krb5-strength 3.1-1dh_auto_test: make -j16 check VERBOSE=1 returned exit code 2 Log
krb5-sync 3.1-1dh_auto_test: make -j16 check VERBOSE=1 returned exit code 2 Log
kstart 4.2-1dh_auto_test: make -j16 check VERBOSE=1 returned exit code 2 Log
lam 7.1.4-3.1configure: error: *** Cannot continue. Log
lbcd 3.5.2-2dh_auto_test: make -j16 check VERBOSE=1 returned exit code 2 Log
lcgdm 1.9.0-2Undetected errorLog
libapache2-mod-perl2 2.0.10-2Tests failures Log
libautovivification-perl 0.17-1Tests failures Log
libbpp-seq-omics 2.3.1-4Tests failures Log
libbuffy-bindings 0.16Tests failures Log
libclass-xsaccessor-perl 1.19-2Tests failures Log
libdata-uuid-perl 1.220-1Tests failures Log
libdbi-drivers 0.9.0-5Undetected errorLog
libdevel-cover-perl 1.25-2Tests failures Log
libembperl-perl 2.5.0-11Tests failures Log
libfcgi-perl 0.78-2Tests failures Log
libfile-map-perl 0.64-2dh_auto_test: perl Build test --verbose 1 returned exit code 2 Log
libfiu 0.95-4Tests failures Log
libglvnd 0.2.999+git20170802-2../../../src/util/glvnd_genentry.c:46:26: error: macro expansion producing 'defined' has undefined behavior [-Werror,-Wexpansion-to-defined] Log
libgpiv 0.6.1-6configure: error: "libgomp not installed" Log
libindirect-perl 0.37-1Tests failures Log
libldm 0.2.3-5ldmtool.c:95:12: error: missing field 'action' initializer [-Werror,-Wmissing-field-initializers] Log
libncursesada 6.0.20170708-2configure: error: No usable Ada compiler found Log
libnet-ssleay-perl 1.80-1Tests failures Log
libodb-qt 2.4.0-2configure: error: QtCore is not found; consider using CPPFLAGS/LDFLAGS to specify its location Log
libomxalsa 0.1-2configure: error: POSIX threads support is required Log
libomxcamera 0.1-2configure: error: in `/<>' Log
libomxfbdevsink 0.1-2configure: error: in `/<>' Log
libomxmad 0.1-1configure: error: POSIX threads support is required Log
libomxvideosrc 0.1-1configure: error: in `/<>' Log
libomxvorbis 0.1-3configure: error: in `/<>' Log
libomxxvideo 0.1-3configure: error: POSIX threads support is required Log
libpam-afs-session 2.6-1dh_auto_test: make -j16 check VERBOSE=1 returned exit code 2 Log
libpam-krb5 4.7-4Tests failures Log
libqaccessibilityclient 0.1.1-5accessibleobject.h:718:38: error: no function named 'operator<<' with type 'QDebug (QDebug, const QAccessibleClient::AccessibleObject &)' was found in the specified scope Log
libreoffice 1:5.4.0-1configure: error: openCOLLADA headers not found. Install openCOLLADA Log
libscope-upper-perl 0.29-1Tests failures Log
libset-object-perl 1.35-1Tests failures Log
libtemplates-parser 17.2-2Undetected errorLog
libtorrent 0.13.6-2c++0x_warning.h:32:2: error: In file included from data/chunk_list_test.cc:3: Log
libvariable-magic-perl 0.61-1Tests failures Log
libvirt 3.6.0-1Tests failures Log
libvmime 0.9.2-3Undetected errorLog
libwx-perl 1:0.9932-2Undetected errorLog
libwx-scintilla-perl 0.39-3Undetected errorLog
libxres 2:1.0.7-3Dependencies installation failed Log
libyami-utils 1.1.0-1VideoDecoderHost.h:38:26: error: 'getVideoDecoderMimeTypes' has C-linkage specified, but returns incomplete type 'std::vector' (aka 'vector >') which could be incompatible with C [-Werror,-Wreturn-type-c-linkage] Log
libzypp 16.4.3-1SolvIterMixin.h:169:60: error: invalid use of incomplete type 'zypp::asPoolItem' Log
lilv 0.24.2~dfsg0-1Undetected errorLog
linbox 1.4.2-4configure: error: in `/<>' Log
lookup 1.08b-11lib/romaji2kana.c:59:12: error: source file is not valid UTF-8 Log
lv2 1.14.0~dfsg1-1dh_install: missing files, aborting Log
mame 0.188+dfsg.1-1/bin/sh: 1: clang++: not found Log
mandelbulber 1:1.21.1-1.1../src/Render3D.cpp:1412:25: error: non-aggregate type 'CVector3' cannot be initialized with an initializer list Log
marisa 0.2.4-8dh_auto_test: make -j1 check VERBOSE=1 returned exit code 2 Log
memtest86 4.3.7-3main.c:229:2: error: indirect goto in function with no address-of-label expressions Log
memtest86+ 5.01-3main.c:223:2: error: indirect goto in function with no address-of-label expressions Log
mira 4.9.6-3clang: error: argument to '-V' is missing (expected 1 value) Log
mlucas 14.1-2configure: error: in `/<>' Log
mona 1.4-17-1configure: error: C++ compiler not found Log
mongodb 1:3.2.11-3Undetected errorLog
movit 1.5.3-1ycbcr_input_test.cpp:1036:17: error: variable-sized object may not be initialized Log
mpich 3.3~a2-2configure: error: Unable to configure with Fortran support because configure could not determine the size of a Fortran INTEGER. Consider setting CROSS_F77_SIZEOF_INTEGER to the length in bytes of a Fortran INTEGER Log
mrs 6.0.5+dfsg-2Undetected errorLog
mstflint 4.6.0-1mflash/Makefile.am:39: error: 'libmflash.a' is not a standard libtool library name Log
mxt-app 1.27-2src/test/run_unit_tests.c:41:5: error: expression which evaluates to zero treated as a null pointer constant of type 'CMFixtureFunction' (aka 'int (*)(void **)') [-Werror,-Wnon-literal-null-conversion] Log
nn 6.7.3-10make[2]: *** No rule to make target ' articles.h', needed by 'nn.o'. Stop. Log
npapi-vlc 2.0.6-4control/nporuntime.h:225:13: error: static declaration of 'RuntimeNPClassGetProperty' follows non-static declaration Log
ns2 2.35+dfsg-2.1common/tclAppInit.cc:240:26: error: declaration of 'globalMemTrace' has a different language linkage Log
ns3 3.26+dfsg-1Undetected errorLog
nwchem 6.6+r27746-4configure: error: f2c string convention is neither after args nor after string Log
oce 0.17.2-2Tests failures Log
ogmrip 1.0.1-1ogmrip-encoding.c:1200:7: error: cast to union type from type 'int' not present in union Log
opari2 1.0.7+dfsg-6dh_install: missing files, aborting Log
open-cobol 1.1-2dh_auto_test: make -j1 check VERBOSE=1 returned exit code 2 Log
openfoam 4.1+dfsg1-1lnInclude/CrankNicolsonDdtScheme.C:104:1: error: missing 'typename' prior to dependent type template name 'CrankNicolsonDdtScheme::DDt0Field' Log
opengm 2.3.6+20160905-1Undetected errorLog
openjade 1.4devel1-21.3configure: error: cannot compute sizeof (size_t) Log
openmpi 2.1.1-6configure: error: Cannot continue Log
openmsx-catapult 0.14.0-1Undetected errorLog
openvpn-auth-ldap 2.0.3-6.1configure: error: Can't locate Objective C runtime headers Log
orthanc 1.3.0+dfsg-1osconfig.h:1117:2: error: DCMTK was configured to use the C++11 STL, but your compiler is not configured for building with C++11 features. Log
orthanc-wsi 0.4+dfsg-2osconfig.h:1117:2: error: DCMTK was configured to use the C++11 STL, but your compiler is not configured for building with C++11 features. Log
paexec 1.0.1-4dh_auto_test: mkcmake PREFIX=/usr MANDIR=/usr/share/man INFODIR=/usr/share/info SYSCONFDIR=/etc LIBDIR=/usr/lib/x86_64-linux-gnu LIBEXECDIR=/usr/lib/x86_64-linux-gnu test returned exit code 1 Log
paw 1:2.14.04.dfsg.2-9.1Undetected errorLog
pbcopper 0.0.1+20161202-2Tests failures Log
pcl 1.8.1+dfsg1-2selectionTransformTool.cpp:198:15: error: cannot take the address of an rvalue of type 'float' Log
pcp 3.12.1access.o: r .L.str.1 : Error: additional symbol Log
pdns 4.0.4-2json11.cpp:153:24: error: invalid operands to binary expression ('nullptr_t' and 'nullptr_t') Log
plastimatch 1.6.5+dfsg.1-1osconfig.h:1117:2: error: DCMTK was configured to use the C++11 STL, but your compiler is not configured for building with C++11 features. Log
ppl 1:1.2-2./OR_Matrix_inlines.hh:100:8: error: missing 'typename' prior to dependent type template name 'OR_Matrix::Pseudo_Row' Log
prime-phylo 1.0.11-4PrimeOptionMap.hh:161:32: error: no function named 'operator<<' with type 'std::ostream &(std::ostream &, const beep::PrimeOptionMap &)' (aka 'basic_ostream &(basic_ostream &, const beep::PrimeOptionMap &)') was found in the specified scope Log
primus 0~20150328-4./gl-passthru.def:2:1: error: ifunc must point to a defined function Log
promoe 0.1.1-3coll.h:615:6: error: binding value of type 'const Xmms::Coll::Coll' to reference to type 'Xmms::Coll::Coll' drops 'const' qualifier Log
py3cairo 1.10.0+dfsg-5Tests failures Log
pymol 1.8.4.0+dfsg-1contrib/champ/champ.c:2787:3: error: unterminated function-like macro invocation Log
python-enable 4.5.1-3Undetected errorLog
python-escript 5.0-4Undetected errorLog
qbs 1.8.1+dfsg-3dh_auto_test: make -j16 check returned exit code 2 Log
qca2 2.1.3-1sh: 1: error: Problems running dot: exit code=127, command='dot', arguments='"/<>/build-qt5/apidocs/html/qca__publickey_8h__dep__incl.dot" -Tpng -o "/<>/build-qt5/apidocs/html/qca__publickey_8h__dep__incl.png"' Log
qdjango 0.6.2-2dh_auto_test: make -j1 check returned exit code 2 Log
qjackctl 0.4.5-1Undetected errorLog
quickfix 1.14.4+dfsg-1Undetected errorLog
refind 0.10.4-1Undetected errorLog
regina-normal 5.1-2sequence.h:563:8: error: missing 'typename' prior to dependent type template name 'LightweightSequence::SubsequenceCompareFirstPtr' Log
reprepro 5.1.1-1sourceextraction.c:135:2: error: illegal storage class on function Log
rheolef 6.7-3configure: error: CLANG compiler problem: g++ is unable to link with the std C++ library Log
rnetclient 2017.1-1rnetclient.c:78:9: error: missing field 'key' initializer [-Werror,-Wmissing-field-initializers] Log
scheme48 1.9-5Undetected errorLog
serd 0.28.0~dfsg0-1Undetected errorLog
sheepdog 0.8.3-4.1:1:9: error: unknown token in expression in '.set' directive Log
shibboleth-resolver 1.0.0-1configure: error: unable to find OpenSAML header files Log
showq 0.4.1+git20161215~dfsg0-2Undetected errorLog
sks-ecc 0.93-6tfm/mpi.c:2565:15: error: unknown register name '%cc' in asm Log
slic3r-prusa 1.37.0+dfsg-1Undetected errorLog
sniffles 1.0.2+ds-1Undetected errorLog
sofa-framework 1.0~beta4-12../../../modules/sofa/component/topology/QuadSetGeometryAlgorithms.h:113:14: error: inline declaration of 'areaProduct' follows non-inline definition Log
sord 0.16.0~dfsg0-1Undetected errorLog
soundmodem 0.20-5../matlib/mat.hh:452:6: error: assigning to 'unsigned int *' from incompatible type 'void *' Log
sparse 0.5.0-4test-dissect.c:50:25: error: initialization of flexible array member is not allowed Log
sphde 1.3.0-1./sasatom_x86_64.h:90:56: error: unsupported inline asm: input with type 'long' matching output with type 'char' Log
sratom 0.6.0~dfsg0-1Undetected errorLog
stdsyslog 0.03.1-3stdsyslog.c:549:121: error: format specifies type 'void *' but the argument has type 'char *' [-Werror,-Wformat-pedantic] Log
stoken 0.91-1configure: error: Package requirements (nettle >= 2.4) were not met Log
stx-btree 0.9-2WTreeDrawing.cpp:77:30: error: typedef 'btree_impl' cannot be referenced with a class specifier Log
styx 2.0.1-1sysbase1.c:579:50: error: invalid token at start of a preprocessor expression Log
subtitleeditor 0.54.0-2document.cc:81:40: error: addition of default argument on redeclaration makes this constructor a copy constructor Log
subtle 0.11.3224-xi-2.2Undetected errorLog
suil 0.8.4~dfsg0-2Undetected errorLog
sushi 1.4.0+git20160822+dfsg-4Undetected errorLog
t50 5.7.0-2randomizer.c:83:7: error: unknown use of instruction mnemonic without a size suffix Log
tcptrack 1.4.2-2./IPAddress.h:19:58: error: all paths through this function will call itself [-Werror,-Winfinite-recursion] Log
teem 1.12.0~20160122-2Tests failures Log
theano 0.8.2-6Tests failures Log
thin-provisioning-tools 0.6.1-4Tests failures Log
tpb 0.6.4-11Undetected errorLog
troffcvt 1.04-23Undetected errorLog
udisks2 2.6.5-2dh_auto_test: make -j16 check VERBOSE=1 returned exit code 2 Log
vboot-utils 0~R52-8350.B-2Tests failures Log
vdr-plugin-softhddevice 0.6.0+git20160108-1make[1]: *** No rule to make target 'alsa/iatomic.h', needed by 'softhddev.o'. Stop. Log
vowpal-wabbit 8.1.1-1Tests failures Log
vulkan 1.0.54.0+dfsg1-1local_single_store_elim_pass.cpp:213:39: error: lambda capture 'ordered_blocks' is not used [-Werror,-Wunused-lambda-capture] Log
webauth 4.7.0-5dh_auto_test: make -j16 check VERBOSE=1 returned exit code 2 Log
websocketpp 0.7.0-11clang: error: no input files Log
wesnoth-1.12 1:1.12.6-1Undetected errorLog
wmaker 0.95.8-2Undetected errorLog
writerperfect 0.9.5-1EPUBDrawingGenerator.h:37:27: error: 'override' keyword is a C++11 extension [-Werror,-Wc++11-extensions] Log 751906
wvdial 1.61-4.1uniconfgen.h:323:19: error: no class named 'Iter' in 'UniConfGen' Log
wvstreams 4.6.1-11./include/wvscatterhash.h:186:46: error: invalid use of non-static data member 'xstatus' Log
xcftools 1.0.7-6Undetected errorLog
xine-lib-1.2 1.2.6-1.3x86_64-linux-gnu-ld: final link failed: Bad value Log
xmms2 0.8+dfsg-18coll.h:615:6: error: binding value of type 'const Xmms::Coll::Coll' to reference to type 'Xmms::Coll::Coll' drops 'const' qualifier Log
xmpi 2.2.3b8-13.2configure: error: cannot continue -- cannot find Log
z80ex 1.1.21-1dh_install: missing files, aborting Log
zbackup 1.4.4-2shared_ptr.h:431:32: error: too few arguments provided to function-like macro invocation Log
zeitgeist 0.9.16-0.2indexer.cpp:685:13: error: cannot cast from type 'gboolean (ZeitgeistFTS::Indexer::*)()' to pointer type 'GSourceFunc' (aka 'int (*)(void *)') Log
254 errors
Return to the list