Debian Package rebuild

Rebuild of the Debian archive with clang

PackageVersionFull logSupposed error message
theano0.9.0+dfsg-2LogException: ("Compilation failed (return status=1): In file included from /<>/theano-0.9.0+dfsg/.pybuild/compiledir_Linux-4.9--amd64-x86_64-with-debian-buster-sid--2.7.15-64/tmpNGVecH/mod.cpp:1:. In file included from /usr/include/python2.7/Python.h:88:. /usr/include/python2.7/unicodeobject.h:534:5: warning: 'register' storage class specifier is deprecated and incompatible with C++17 [-Wdeprecated-register]. register PyObject *obj, /* Object */. ^~~~~~~~~. /usr/include/python2.7/unicodeobject.h:553:5: warning: 'register' storage class specifier is deprecated and incompatible with C++17 [-Wdeprecated-register]. register PyObject *obj /* Object */. ^~~~~~~~~. /usr/include/python2.7/unicodeobject.h:575:5: warning: 'register' storage class specifier is deprecated and incompatible with C++17 [-Wdeprecated-register]. register const wchar_t *w, /* wchar_t buffer */. ^~~~~~~~~. /usr/include/python2.7/unicodeobject.h:593:5: warning: 'register' storage class specifier is deprecated and incompatible with C++17 [-Wdeprecated-register]. register wchar_t *w, /* wchar_t buffer */. ^~~~~~~~~. In file included from /<>/theano-0.9.0+dfsg/.pybuild/compiledir_Linux-4.9--amd64-x86_64-with-debian-buster-sid--2.7.15-64/tmpNGVecH/mod.cpp:1:. In file included from /usr/include/python2.7/Python.h:97:. /usr/include/python2.7/stringobject.h:173:5: warning: 'register' storage class specifier is deprecated and incompatible with C++17 [-Wdeprecated-register]. register PyObject *obj, /* string or Unicode object */. ^~~~~~~~~. /usr/include/python2.7/stringobject.h:174:5: warning: 'register' storage class specifier is deprecated and incompatible with C++17 [-Wdeprecated-register]. register char **s, /* pointer to buffer variable */. ^~~~~~~~~. /usr/include/python2.7/stringobject.h:175:5: warning: 'register' storage class specifier is deprecated and incompatible with C++17 [-Wdeprecated-register]. register Py_ssize_t *len /* pointer to length variable or NULL. ^~~~~~~~~. /<>/theano-0.9.0+dfsg/.pybuild/compiledir_Linux-4.9--amd64-x86_64-with-debian-buster-sid--2.7.15-64/tmpNGVecH/mod.cpp:408:27: error: non-constant-expression cannot be narrowed from type 'npy_intp' (aka 'long') to 'int' in initializer list [-Wc++11-narrowing]. int init_totals[4] = {V1_n0, V1_n1, V1_n2, V1_n3};. ^~~~~. /<>/theano-0.9.0+dfsg/.pybuild/compiledir_Linux-4.9--amd64-x86_64-with-debian-buster-sid--2.7.15-64/tmpNGVecH/mod.cpp:408:27: note: insert an explicit cast to silence this issue. int init_totals[4] = {V1_n0, V1_n1, V1_n2, V1_n3};. ^~~~~. static_cast( ). /<>/theano-0.9.0+dfsg/.pybuild/compiledir_Linux-4.9--amd64-x86_64-with-debian-buster-sid--2.7.15-64/tmpNGVecH/mod.cpp:408:34: error: non-constant-expression cannot be narrowed from type 'npy_intp' (aka 'long') to 'int' in initializer list [-Wc++11-narrowing]. int init_totals[4] = {V1_n0, V1_n1, V1_n2, V1_n3};. ^~~~~. /<>/theano-0.9.0+dfsg/.pybuild/compiledir_Linux-4.9--amd64-x86_64-with-debian-buster-sid--2.7.15-64/tmpNGVecH/mod.cpp:408:34: note: insert an explicit cast to silence this issue. int init_totals[4] = {V1_n0, V1_n1, V1_n2, V1_n3};. ^~~~~. static_cast( ). /<>/theano-0.9.0+dfsg/.pybuild/compiledir_Linux-4.9--amd64-x86_64-with-debian-buster-sid--2.7.15-64/tmpNGVecH/mod.cpp:408:41: error: non-constant-expression cannot be narrowed from type 'npy_intp' (aka 'long') to 'int' in initializer list [-Wc++11-narrowing]. int init_totals[4] = {V1_n0, V1_n1, V1_n2, V1_n3};. ^~~~~. /<>/theano-0.9.0+dfsg/.pybuild/compiledir_Linux-4.9--amd64-x86_64-with-debian-buster-sid--2.7.15-64/tmpNGVecH/mod.cpp:408:41: note: insert an explicit cast to silence this issue. int init_totals[4] = {V1_n0, V1_n1, V1_n2, V1_n3};. ^~~~~. static_cast( ). /<>/theano-0.9.0+dfsg/.pybuild/compiledir_Linux-4.9--amd64-x86_64-with-debian-buster-sid--2.7.15-64/tmpNGVecH/mod.cpp:408:48: error: non-constant-expression cannot be narrowed from type 'npy_intp' (aka 'long') to 'int' in initializer list [-Wc++11-narrowing]. int init_totals[4] = {V1_n0, V1_n1, V1_n2, V1_n3};. ^~~~~. /<>/theano-0.9.0+dfsg/.pybuild/compiledir_Linux-4.9--amd64-x86_64-with-debian-buster-sid--2.7.15-64/tmpNGVecH/mod.cpp:408:48: note: insert an explicit cast to silence this issue. int init_totals[4] = {V1_n0, V1_n1, V1_n2, V1_n3};. ^~~~~. static_cast( ). /<>/theano-0.9.0+dfsg/.pybuild/compiledir_Linux-4.9--amd64-x86_64-with-debian-buster-sid--2.7.15-64/tmpNGVecH/mod.cpp:427:1: error: non-constant-expression cannot be narrowed from type 'ssize_t' (aka 'long') to 'int' in initializer list [-Wc++11-narrowing]. V1_stride0, V1_stride1, V1_stride2, V1_stride3. ^~~~~~~~~~. /<>/theano-0.9.0+dfsg/.pybuild/compiledir_Linux-4.9--amd64-x86_64-with-debian-buster-sid--2.7.15-64/tmpNGVecH/mod.cpp:427:1: note: insert an explicit cast to silence this issue. V1_stride0, V1_stride1, V1_stride2, V1_stride3. ^~~~~~~~~~. static_cast( ). /<>/theano-0.9.0+dfsg/.pybuild/compiledir_Linux-4.9--amd64-x86_64-with-debian-buster-sid--2.7.15-64/tmpNGVecH/mod.cpp:427:13: error: non-constant-expression cannot be narrowed from type 'ssize_t' (aka 'long') to 'int' in initializer list [-Wc++11-narrowing]. V1_stride0, V1_stride1, V1_stride2, V1_stride3. ^~~~~~~~~~. /<>/theano-0.9.0+dfsg/.pybuild/compiledir_Linux-4.9--amd64-x86_64-with-debian-buster-sid--2.7.15-64/tmpNGVecH/mod.cpp:427:13: note: insert an explicit cast to silence this issue. V1_stride0, V1_stride1, V1_stride2, V1_stride3. ^~~~~~~~~~. static_cast( ). /<>/theano-0.9.0+dfsg/.pybuild/compiledir_Linux-4.9--amd64-x86_64-with-debian-buster-sid--2.7.15-64/tmpNGVecH/mod.cpp:427:25: error: non-constant-expression cannot be narrowed from type 'ssize_t' (aka 'long') to 'int' in initializer list [-Wc++11-narrowing]. V1_stride0, V1_stride1, V1_stride2, V1_stride3. ^~~~~~~~~~. /<>/theano-0.9.0+dfsg/.pybuild/compiledir_Linux-4.9--amd64-x86_64-with-debian-buster-sid--2.7.15-64/tmpNGVecH/mod.cpp:427:25: note: insert an explicit cast to silence this issue. V1_stride0, V1_stride1, V1_stride2, V1_stride3. ^~~~~~~~~~. static_cast( ). /<>/theano-0.9.0+dfsg/.pybuild/compiledir_Linux-4.9--amd64-x86_64-with-debian-buster-sid--2.7.15-64/tmpNGVecH/mod.cpp:427:37: error: non-constant-expression cannot be narrowed from type 'ssize_t' (aka 'long') to 'int' in initializer list [-Wc++11-narrowing]. V1_stride0, V1_stride1, V1_stride2, V1_stride3. ^~~~~~~~~~. /<>/theano-0.9.0+dfsg/.pybuild/compiledir_Linux-4.9--amd64-x86_64-with-debian-buster-sid--2.7.15-64/tmpNGVecH/mod.cpp:427:37: note: insert an explicit cast to silence this issue. V1_stride0, V1_stride1, V1_stride2, V1_stride3. ^~~~~~~~~~. static_cast( ). 7 warnings and 8 errors generated.. ", '[Elemwise{Cast{float32}}(TensorConstant{(1, 1, 1, 1) of 0})]')