Debian Package rebuild

Rebuild of the Debian archive with clang

"Argument unused caused failure" build failure(s)
clang 10
Return to the list
Unknown or unused arguments triggers errors with -Werror:
clang -Werror -ggdb3 foo.c

Versions: 2.9 - 3.0 - 3.1 - 3.2 - 3.3 - 3.4 - 3.4.2 - 3.5.0 - 3.6.0 - 3.8.1 - 3.9.1 - 4.0.1 - 5.0 - 6.0 - 8.0.1 - 9.0.1 - 10
PackageVersionSupposed error messageFull log Bug report
acpica-unix 20200326-1clang: error: argument unused during compilation: '-pie' [-Werror,-Wunused-command-line-argument] Log
libpsm2 11.2.86-1clang: error: argument unused during compilation: '-specs=/usr/share/dpkg/no-pie-compile.specs' [-Werror,-Wunused-command-line-argument] Log
librdkafka 1.3.0-1clang: error: argument unused during compilation: '-specs=/usr/share/dpkg/no-pie-compile.specs' [-Werror,-Wunused-command-line-argument] Log
python-pyxattr 0.6.1-2clang: error: argument unused during compilation: '-specs=/usr/share/dpkg/no-pie-compile.specs' [-Werror,-Wunused-command-line-argument] Log
skiboot 6.5.2-1clang: error: argument unused during compilation: '-specs=/usr/share/dpkg/no-pie-compile.specs' [-Werror,-Wunused-command-line-argument] Log
sphde 1.4.0-2clang: error: argument unused during compilation: '-mhtm' [-Werror,-Wunused-command-line-argument] Log
6 errors
Return to the list